Methane, bromotrinitro-

Gas phase thermochemistry data

Data compiled by: Hussein Y. Afeefy, Joel F. Liebman, and Stephen E. Stein

Quantity Value Units Method Reference Comment
Δfgas94.6kJ/molCcbPepekin and Korsunskii, 1995

Condensed phase thermochemistry data

Data compiled by: Hussein Y. Afeefy, Joel F. Liebman, and Stephen E. Stein

Quantity Value Units Method Reference Comment
Δfliquid48.5kJ/molCcbPepekin and Korsunskii, 1995
Δfliquid13.5 ± 1.0kJ/molCcrCarpenter, Zimmer, et al., 1970The HBr is in 225H2O

Phase change data

Data compiled as indicated in comments:
ALS - Hussein Y. Afeefy, Joel F. Liebman, and Stephen E. Stein
AC - William E. Acree, Jr., James S. Chickos

Quantity Value Units Method Reference Comment
Δvap46.0kJ/molVPepekin and Korsunskii, 1995ALS
Δvap47.74kJ/molVCarpenter, Zimmer, et al., 1970The HBr is in 225H2O; ALS

Enthalpy of vaporization

ΔvapH (kJ/mol) Temperature (K) Method Reference Comment
47.8326.AStephenson and Malanowski, 1987Based on data from 318. - 335. K. See also Baroody, Carpenter, et al., 1970.; AC

Reaction thermochemistry data

Data compiled by: Hussein Y. Afeefy, Joel F. Liebman, and Stephen E. Stein

Individual Reactions

Methane, bromotrinitro- + 218.5Water + 11.25Oxygen + Diethyl Phthalate = Hydrogen bromide + 13Carbon dioxide + 1.5Nitrogen

By formula: CBrN3O6 + 218.5H2O + 11.25O2 + C12H14O4 = HBr + 13CO2 + 1.5N2

Quantity Value Units Method Reference Comment
Δr-6350.2 ± 1.0kJ/molCcrCarpenter, Zimmer, et al., 1970liquid phase; The HBr is in 225H2O

References

Pepekin and Korsunskii, 1995
Pepekin, V.I.; Korsunskii, B.L., Thermochemistry of halopolynitroalkanes, Dokl. Phys. Chem. (Engl. Transl.), 1995, 340, 14-16, In original 342. [all data]

Carpenter, Zimmer, et al., 1970
Carpenter, G.A.; Zimmer, M.F.; Baroody, E.E.; Robb, R.A., Enthalpy of formation of bromotrinitromethane, J. Chem. Eng. Data, 1970, 15, 553-556. [all data]

Stephenson and Malanowski, 1987
Stephenson, Richard M.; Malanowski, Stanislaw, Handbook of the Thermodynamics of Organic Compounds, 1987, https://doi.org/10.1007/978-94-009-3173-2 . [all data]

Baroody, Carpenter, et al., 1970
Baroody, Edward E.; Carpenter, George A.; Zimmer, Martin F.; Robb, Robert A., Enthalpy of formation of bromotrinitromethane, J. Chem. Eng. Data, 1970, 15, 4, 553-556, https://doi.org/10.1021/je60047a037 . [all data]