Disodium fluoride dioxoborate

Gas phase ion energetics data

Data compiled by: Sharon G. Lias, Rhoda D. Levin, and Sherif A. Kafafi

Appearance energy determinations

Ion AE (eV) Other Products MethodReferenceComment
BO2Na2+6.18 ± 0.10F(-)EIShevchenko, Iljin, et al., 1976
BO2Na2+10.15 ± 0.12FEIShevchenko, Iljin, et al., 1976
FNa2+10.00 ± 0.10BO2EIShevchenko, Iljin, et al., 1976
FNa2+5.86 ± 0.10BO2(-)EIShevchenko, Iljin, et al., 1976

References

Shevchenko, Iljin, et al., 1976
Shevchenko, V.E.; Iljin, M.K.; Nikitin, O.T.; Sidorov, L.N., Mass-spectrometric study of mixed dimers M2BO2F, Int. J. Mass Spectrom. Ion Phys., 1976, 21, 279. [all data]