pent-3-enal

Phase change data

Data compiled by: Thermodynamics Research Center, NIST Boulder Laboratories, Chris Muzny director

Quantity Value Units Method Reference Comment
Tboil379.KN/AGorge, 1951Uncertainty assigned by TRC = 4. K

In addition to the Thermodynamics Research Center (TRC) data available from this site, much more physical and chemical property data is available from the following TRC products:

References

Gorge, 1951
Gorge, M., New Contributions to the Studyof γ-Ethylene Glycols, Ann. Chim.(Paris), 1951, 6, 649-704. [all data]