CAS Reg. No. 56027-44-2

Reaction thermochemistry data

Data compiled by: John E. Bartmess

Individual Reactions

(CAS Reg. No. 56027-44-2 • 4294967295F5Te) + F5Te = CAS Reg. No. 56027-44-2

By formula: (CAS Reg. No. 56027-44-2 • 4294967295F5Te) + F5Te = CAS Reg. No. 56027-44-2

Quantity Value Units Method Reference Comment
Δr803. ± 46.kJ/molTherCompton, Reinhardt, et al., 1978gas phase

References

Compton, Reinhardt, et al., 1978
Compton, R.N.; Reinhardt, P.W.; Cooper, C.D., Collisional ionization between fast alkali atoms and selected hexafluoride molecules, J. Chem. Phys., 1978, 68, 2023. [all data]