Methyl 3-(4-hydroxy-3-methoxyphenyl)propanoate

Van Den Dool and Kratz RI, non-polar column, custom temperature program

View large format table.

Column type Active phase I Reference Comment
CapillaryHP-5MS1683.8Andriamaharavo, 201430. m/0.25 mm/0.25 μm, He; Program: 60C (1 min) => 5 C/min => 210C => 10 C/min => 280C (15 min)

Normal alkane RI, non-polar column, temperature ramp

View large format table.

Column type Active phase I Reference Comment
CapillaryOV-1011644.Spiteller and Spiteller, 1979He, 75. C @ 7. min, 2. K/min; Column length: 25. m; Tend: 280. C

References

Andriamaharavo, 2014
Andriamaharavo, N.R., Retention Data. NIST Mass Spectrometry Data Center., NIST Mass Spectrometry Data Center, 2014. [all data]

Spiteller and Spiteller, 1979
Spiteller, M.; Spiteller, G., Trennung und charakterisierung saurer harnbest and- teile, J. Chromatogr., 1979, 164, 3, 253-317, https://doi.org/10.1016/S0378-4347(00)81232-3 . [all data]