Tetradecanoic acid, 2-hydroxy-, methyl ester

Normal alkane RI, non-polar column, custom temperature program

Data compiled by: NIST Mass Spectrometry Data Center, William E. Wallace, director

Column type Capillary
Active phase RTx-1
Column length (m) 60.
Carrier gas Helium
Substrate
Column diameter (mm) 0.22
Phase thickness (μm) 0.25
Program not specified
I 1826.
ReferenceDib, Bendahou, et al., 2010
Comment MSDC-RI

References

Dib, Bendahou, et al., 2010
Dib, M.A.; Bendahou, M.; Bendiabdellah, A.; Djabou, N.; Allali, H.; Tabti, B.; Paolini, J.; Costa, J., Partial chemical composition and antimicrobial activity of Daucus crinitus Desf. extracts, Grasas y Aceites, 2010, 61, 3, 271-278, https://doi.org/10.3989/gya.122609 . [all data]