Chloropyriphos-methyl
- Formula: C7H7Cl3NO3PS
- Molecular weight: 322.533
- IUPAC Standard InChIKey: HRBKVYFZANMGRE-UHFFFAOYSA-N
- CAS Registry Number: 5598-13-0
- Chemical structure:

Phase change data

Data compiled as indicated in comments:
TRC - Thermodynamics Research Center, NIST Boulder Laboratories, Chris Muzny director
AC - William E. Acree, Jr., James S. Chickos
Quantity | Value | Units | Method | Reference | Comment |
---|---|---|---|---|---|
Tfus | 319.16 | K | N/A | Donnelly, Drewes, et al., 1990 | Uncertainty assigned by TRC = 0.2 K; TRC |
Enthalpy of vaporization
ΔvapH (kcal/mol) | Temperature (K) | Method | Reference | Comment |
---|---|---|---|---|
17.4 | 373. to 403. | GC | Goel, McConnell, et al., 2007 | AC |
Enthalpy of fusion
ΔfusH (kcal/mol) | Temperature (K) | Method | Reference | Comment |
---|---|---|---|---|
6.195 | 318.7 | DSC | Donnelly, Drewes, et al., 1990, 2 | AC |

Henry's Law data

Data compiled by: Rolf Sander

Henry's Law constant (water solution)

kH(T) = H exp(d(ln(kH))/d(1/T) ((1/T) - 1/(298.15 K)))
H = Henry's law constant for solubility in water at 298.15 K (mol/(kg*bar))
d(ln(kH))/d(1/T) = Temperature dependence constant (K)

H (mol/(kg*bar)) d(ln(kH))/d(1/T) (K) Method Reference
330. LN/A

Normal alkane RI, non-polar column, custom temperature program

Data compiled by: NIST Mass Spectrometry Data Center, William E. Wallace, director

Column type CapillaryCapillaryCapillaryCapillary
Active phase 5 % Phenyl methyl siloxane5 % Phenyl methyl siloxaneHP-5Ultra-1
Column length (m) 30.30.30.
Carrier gas HeliumHelium
Substrate
Column diameter (mm) 0.250.250.25
Phase thickness (μm) 0.250.250.25
Program 50 0C(1 min) 25 0C/min -> 125 0C 10 0C/min -> 300 0C (10 min)50 0C(1 min) 25 0C/min -> 125 0C 10 0C/min -> 300 0C (10 min)50 0C (1 min) 20 0C/min -> 150 0C 10 0C/min -> 280 0Cnot specified
I 1885.1885.1879.1824.
ReferenceDepartment of Food Safety and Welfare, 2006Department of Food Safety and Welfare, 2006Kawara, Asada, et al., 2005Tameo and Kiyos, 1991
Comment MSDC-RI MSDC-RI MSDC-RI MSDC-RI

References

Donnelly, Drewes, et al., 1990
Donnelly, J.R.; Drewes, L.A.; Johnson, R.L.; Munslow, W.D.; Knapp, K.K.; Sovocool, G.W.,
Purity and heat of fusion data for environmental standards as determined by differential scanning calorimetry,
Thermochim. Acta, 1990, 167, 2, 155, https://doi.org/10.1016/0040-6031(90)80476-F
. [all data]
Goel, McConnell, et al., 2007
Goel, Anubha; McConnell, Laura L.; Torrents, Alba,
Determination of vapor pressure-temperature relationships of current--use pesticides and transformation products,
Journal of Environmental Science and Health, Part B, 2007, 42, 4, 343-349, https://doi.org/10.1080/03601230701309494
. [all data]
Donnelly, Drewes, et al., 1990, 2
Donnelly, J.R.; Drewes, L.A.; Johnson, R.L.; Munslow, W.D.; Knapp, K.K.; Sovocool, G.W.,
Purity and heat of fusion data for environmental standards as determined by differential scanning calorimetry,
Thermochimica Acta, 1990, 167, 2, 155-187, https://doi.org/10.1016/0040-6031(90)80476-F
. [all data]