Dispiro[2.0.2.3]nona-1,5-diene

Gas phase ion energetics data

Data compiled as indicated in comments:
LBLHLM - Sharon G. Lias, John E. Bartmess, Joel F. Liebman, John L. Holmes, Rhoda D. Levin, and W. Gary Mallard

Ionization energy determinations

IE (eV) Method Reference Comment
8.3PESpanget-Larsen, de Korswagen, et al., 1982LBLHLM
8.63PESpanget-Larsen, de Korswagen, et al., 1982Vertical value; LBLHLM

References

Spanget-Larsen, de Korswagen, et al., 1982
Spanget-Larsen, J.; de Korswagen, C.; Eckert-Maksic, M.; Gleiter, R., 90. Electronic and molecular structure of simple 3,3'-bicyclopropenyls. Photoelectron spectroscopy and model calculations, Helv. Chim. Acta, 1982, 65, 968. [all data]