Naphthalene, 1,2,3,4,4a,5,6,8a-octahydro-4a,8-dimethyl-

Normal alkane RI, polar column, temperature ramp

Data compiled by: NIST Mass Spectrometry Data Center, William E. Wallace, director

Column type Capillary
Active phase DB-Wax
Column length (m) 30.
Carrier gas He
Substrate
Column diameter (mm) 0.2
Phase thickness (μm)
Tstart (C) 50.
Tend (C) 180.
Heat rate (K/min) 3.
Initial hold (min) 8.
Final hold (min)
I 1685.
ReferenceFranco and Shibamoto, 2000
Comment MSDC-RI

References

Franco and Shibamoto, 2000
Franco, M.R.B.; Shibamoto, T., Volatile composition of some Brazilian fruits: umbu-caja (Spondias citherea), camu-camu (Myrciaria dubia), araca-boi (Eugenia stipitata), and cupuacu (Theobroma grandiflorum), J. Agric. Food Chem., 2000, 48, 4, 1263-1265, https://doi.org/10.1021/jf9900074 . [all data]