Lindane

Gas phase thermochemistry data

Data compiled by: Hussein Y. Afeefy, Joel F. Liebman, and Stephen E. Stein

Quantity Value Units Method Reference Comment
Δfgas-295.8 ± 2.9kJ/molCcbAn and Guo, 1995Author was aware that data differs from previously reported values; HCl(1:600 H2O)

References

An and Guo, 1995
An, X.-W.; Guo, D.-J., Formation enthalpies and non-bonding interactions of hexachlorocyclohexanes, Thermochim. Acta, 1995, 253, 235-242. [all data]