CClBr+

Vibrational and/or electronic energy levels

Data compiled by: Marilyn E. Jacox

State:   X

Vib.
sym.
 No.   Approximate
 type of mode
 cm-1   Med.   Method   References

CCl stretch 1120.6 Ar IR Andrews and Keelan, 1979
Kelsall and Andrews, 1983
Fridgen, Zhang, et al., 2000

Additional references: Jacox, 1994, page 91; Jacox, 2003, page 135

References

Andrews and Keelan, 1979
Andrews, L.; Keelan, B.W., Infrared spectra, structure, and bonding in the dihalocarbene cations in solid argon, J. Am. Chem. Soc., 1979, 101, 13, 3500, https://doi.org/10.1021/ja00507a014 . [all data]

Kelsall and Andrews, 1983
Kelsall, B.J.; Andrews, L., FTIR spectroscopic studies of the matrix photoionization and photolysis products of methylene halides, J. Mol. Spectrosc., 1983, 97, 2, 362, https://doi.org/10.1016/0022-2852(83)90274-6 . [all data]

Fridgen, Zhang, et al., 2000
Fridgen, T.D.; Zhang, X.K.; Parnis, J.M.; March, R.E., Isomerization and Fragmentation Products of CH, J. Phys. Chem. A, 2000, 104, 16, 3487, https://doi.org/10.1021/jp993162u . [all data]

Jacox, 1994
Jacox, M.E., Vibrational and electronic energy levels of polyatomic transient molecules, American Chemical Society, Washington, DC, 1994, 464. [all data]

Jacox, 2003
Jacox, M.E., Vibrational and electronic energy levels of polyatomic transient molecules: supplement B, J. Phys. Chem. Ref. Data, 2003, 32, 1, 1-441, https://doi.org/10.1063/1.1497629 . [all data]