2,2,3,3,4,4,5,5,6,6-Decafluoropiperidine

Phase change data

Data compiled by: William E. Acree, Jr., James S. Chickos

Enthalpy of vaporization

ΔvapH (kJ/mol) Temperature (K) Method Reference Comment
32.7288.AStephenson and Malanowski, 1987Based on data from 273. - 313. K. See also Schneider, Garbers, et al., 1964.

References

Stephenson and Malanowski, 1987
Stephenson, Richard M.; Malanowski, Stanislaw, Handbook of the Thermodynamics of Organic Compounds, 1987, https://doi.org/10.1007/978-94-009-3173-2 . [all data]

Schneider, Garbers, et al., 1964
Schneider, D.F.; Garbers, C.F.; Olliff, R.W.; Odell, A.L.; Nixon, John F.; Addy, J. Keith; Noyes, Richard M.; Cremlyn, R.J.W.; Adams, P.R.; Hickinbottom, W.J.; Lathwood, E.; Suschitzky, H.; Jones, D.; Wilkinson, G.; Fitton, A.O.; Ramage, G.R.; Bryce-Smith, D.; Wakefield, B.J.; Banks, R.E.; Cheng, W.M.; Haszeldine, R.N.; Crofts, P.C.; Gosling, K., Notes, J. Chem. Soc., 1964, 2465, https://doi.org/10.1039/jr9640002465 . [all data]