(Z) 4-Phenyl-3-nitro-3-buten-2-one

Reaction thermochemistry data

Data compiled by: Hussein Y. Afeefy, Joel F. Liebman, and Stephen E. Stein

Individual Reactions

(Z) 4-Phenyl-3-nitro-3-buten-2-one = 3-Buten-2-one, 3-nitro-4-phenyl-, (E)-

By formula: C10H9NO3 = C10H9NO3

Quantity Value Units Method Reference Comment
Δr-19.9kJ/molEqkBlaha and Leseticky, 1986liquid phase; solvent: Nitrobenzene; NMR

References

Blaha and Leseticky, 1986
Blaha, I.; Leseticky, L., Isomerization of nitro olefins. Part V. Preparation and Z-E isomerization of substituted nitrostyrenes, Collect. Czech. Chem. Commun., 1986, 51, 1094-1099. [all data]