2-Pentenedioic acid, 3-methyl-, bis(trimethylsilyl) ester

Van Den Dool and Kratz RI, non-polar column, temperature ramp

Data compiled by: NIST Mass Spectrometry Data Center, William E. Wallace, director

Column type CapillaryCapillaryCapillaryCapillaryCapillary
Active phase OV-1SE-52SE-52SE-52SE-52
Column length (m) 10.25.25.25.25.
Carrier gas HeHeHeHeHe
Substrate
Column diameter (mm) 0.220.320.320.200.20
Phase thickness (μm) 0.170.520.520.400.40
Tstart (C) 70.70.70.50.50.
Tend (C) 270.270.270.270.270.
Heat rate (K/min) 5.5.5.5.5.
Initial hold (min)
Final hold (min)
I 1441.1450.1494.1451.1491.
ReferenceLefevere, Verhaeghe, et al., 1989Lefevere, Verhaeghe, et al., 1989Lefevere, Verhaeghe, et al., 1989Lefevere, Verhaeghe, et al., 1988Lefevere, Verhaeghe, et al., 1988
Comment MSDC-RI MSDC-RI MSDC-RI MSDC-RI MSDC-RI

References

Lefevere, Verhaeghe, et al., 1989
Lefevere, M.F.; Verhaeghe, B.J.; Declerck, D.H.; Van Bocxlaer, J.F.; De Leenheer, A.P.; De Sagher, R.M., Metabolic Profiling of Urinary Organic Acids by Single and Multicolumn Capillary Gas Chromatography, J. Chromatogr. Sci., 1989, 27, 1, 23-29, https://doi.org/10.1093/chromsci/27.1.23 . [all data]

Lefevere, Verhaeghe, et al., 1988
Lefevere, M.F.; Verhaeghe, B.J.; Declerck, D.M.; de Leenheer, A.P., Automated profiling of urinary organic acids by dual-column gas chromatography and gas chromatography/mass spectrometry, Biomed. Environ. Mass Spectrom., 1988, 15, 6, 311-322, https://doi.org/10.1002/bms.1200150603 . [all data]