1,3,4-Thiadiazole-2-thiol, 5-phenyl-

Gas phase ion energetics data

Data compiled by: Sharon G. Lias, Rhoda D. Levin, and Sherif A. Kafafi

Ionization energy determinations

IE (eV) Method Reference Comment
8.13PEGuimon, Pfister-Guillouzo, et al., 1975Vertical value

References

Guimon, Pfister-Guillouzo, et al., 1975
Guimon, C.; Pfister-Guillouzo, G.; Arbelot, M., Spectres photoelectroniques d'J. Heterocycl. Chem. carbonyles et thiocarbonyles, Tetrahedron, 1975, 31, 2769. [all data]