Octacosanol

Van Den Dool and Kratz RI, non-polar column, custom temperature program

View large format table.

Column type Active phase I Reference Comment
CapillaryHP-5MS3110.6Andriamaharavo, 201430. m/0.25 mm/0.25 μm, He; Program: 60C (1 min) => 5 C/min => 210C => 10 C/min => 280C (15 min)
CapillaryVF-5MS3118.1Zheng and White, 200830. m/0.25 mm/0.25 μm, He; Program: not specified

Normal alkane RI, non-polar column, temperature ramp

View large format table.

Column type Active phase I Reference Comment
CapillaryHP-5 MS3120.Vedernikov and Roschin, 201030. m/0.25 mm/0.25 μm, Helium, 5. K/min, 280. C @ 10. min; Tstart: 150. C

References

Andriamaharavo, 2014
Andriamaharavo, N.R., Retention Data. NIST Mass Spectrometry Data Center., NIST Mass Spectrometry Data Center, 2014. [all data]

Zheng and White, 2008
Zheng, Y.; White, E., Retention Data. NIST Mass Spectrometry Data Center., NIST Mass Spectrometry Data Center, 2008. [all data]

Vedernikov and Roschin, 2010
Vedernikov, D.N.; Roschin, V.I., Extractive compounds of Birch Buds (Betula pendula Roth.): I. Composition of fatty acids, hydrocarbons , and esters, Rus. J. Bioorg. Chem., 2010, 36, 7, 894-898, https://doi.org/10.1134/S1068162010070174 . [all data]