Tetracosanoic acid

Phase change data

Data compiled as indicated in comments:
BS - Robert L. Brown and Stephen E. Stein
TRC - Thermodynamics Research Center, NIST Boulder Laboratories, Chris Muzny director

Quantity Value Units Method Reference Comment
Tfus358.45KN/AKimura, Takahashi, et al., 1958Uncertainty assigned by TRC = 2. K; TRC

Reduced pressure boiling point

Tboil (K) Pressure (bar) Reference Comment
545.20.013Weast and Grasselli, 1989BS

In addition to the Thermodynamics Research Center (TRC) data available from this site, much more physical and chemical property data is available from the following TRC products:

Kovats' RI, non-polar column, temperature ramp

View large format table.

Column type Active phase I Reference Comment
CapillarySPB-12685.Nagarajan, Rao, et al., 200130. m/0.32 mm/0.25 μm, He, 60. C @ 2. min, 2. K/min, 250. C @ 5. min

Normal alkane RI, non-polar column, temperature ramp

View large format table.

Column type Active phase I Reference Comment
CapillaryHP-52760.Cappellari, Haleem, et al., 201130. m/0.25 mm/0.25 μm, Helium, 4. K/min; Tstart: 150. C; Tend: 290. C

References

Kimura, Takahashi, et al., 1958
Kimura, K.; Takahashi, M.; Tanaka, A., Anodic Synthesis of Fatty Acids III., Yakugaku Zasshi, 1958, 78, 802. [all data]

Weast and Grasselli, 1989
CRC Handbook of Data on Organic Compounds, 2nd Editon, Weast,R.C and Grasselli, J.G., ed(s)., CRC Press, Inc., Boca Raton, FL, 1989, 1. [all data]

Nagarajan, Rao, et al., 2001
Nagarajan, S.; Rao, L.J.M.; Guirudutt, K.N., Chemical composition of the volatiles of Decalepis hamiltonii (Wight Arn), Flavour Fragr. J., 2001, 16, 1, 27-29, https://doi.org/10.1002/1099-1026(200101/02)16:1<27::AID-FFJ937>3.0.CO;2-F . [all data]

Cappellari, Haleem, et al., 2011
Cappellari, S.C.; Haleem, M.A.; Marsaloni, A.J.; Tidon, R.; Simpson, B.B., Pterandra pyroidea: a case of pollination shift within Neotropical Malpighiaceae, Annals of Botany, 2011, 107, 8, 1323-1334, https://doi.org/10.1093/aob/mcr084 . [all data]