Phosphenothious fluoride

Gas phase thermochemistry data

Quantity Value Units Method Reference Comment
Δfgas-172.27kJ/molReviewChase, 1998Data last reviewed in September, 1962
Quantity Value Units Method Reference Comment
gas,1 bar277.72J/mol*KReviewChase, 1998Data last reviewed in September, 1962

Gas Phase Heat Capacity (Shomate Equation)

Cp° = A + B*t + C*t2 + D*t3 + E/t2
H° − H°298.15= A*t + B*t2/2 + C*t3/3 + D*t4/4 − E/t + F − H
S° = A*ln(t) + B*t + C*t2/2 + D*t3/3 − E/(2*t2) + G
    Cp = heat capacity (J/mol*K)
    H° = standard enthalpy (kJ/mol)
    S° = standard entropy (J/mol*K)
    t = temperature (K) / 1000.

View plot Requires a JavaScript / HTML 5 canvas capable browser.

View table.

Temperature (K) 298. - 800.800. - 6000.
A 27.0388157.78899
B 87.967760.257934
C -97.23407-0.056845
D 39.038390.004198
E -0.108550-1.907654
F -183.8224-195.1932
G 287.5759338.7634
H -172.2683-172.2683
ReferenceChase, 1998Chase, 1998
Comment Data last reviewed in September, 1962 Data last reviewed in September, 1962

References

Chase, 1998
Chase, M.W., Jr., NIST-JANAF Themochemical Tables, Fourth Edition, J. Phys. Chem. Ref. Data, Monograph 9, 1998, 1-1951. [all data]