zinc di(acetate)

Condensed phase thermochemistry data

Data compiled by: Eugene S. Domalski and Elizabeth D. Hearing

Constant pressure heat capacity of solid

Cp,solid (cal/mol*K) Temperature (K) Reference Comment
36.71298.Spitsyn, Prozorovskaya, et al., 1984T = 243 to 293 K. Value calculated from equation: Cp(kJ/mol*K) = 3.44x10-2 + 4x10-4T(K).

References

Spitsyn, Prozorovskaya, et al., 1984
Spitsyn, V.I.; Prozorovskaya, Z.N.; Arkhangel'skii, I.V.; Castillo, C.A., The dehydration of zinc acetate dihydrate, Zhur. Neorg. Khim., 1984, 29, 1042-1045. [all data]