Allyl ethyl ether

Phase change data

Data compiled as indicated in comments:
BS - Robert L. Brown and Stephen E. Stein
TRC - Thermodynamics Research Center, NIST Boulder Laboratories, Chris Muzny director
AC - William E. Acree, Jr., James S. Chickos

Quantity Value Units Method Reference Comment
Tboil339.2KN/AWeast and Grasselli, 1989BS
Tboil340.KN/AAmerican Tokyo Kasei, 1988BS
Tboil335.15KN/AKatritzky, Pinzelli, et al., 1970Uncertainty assigned by TRC = 2. K; TRC
Quantity Value Units Method Reference Comment
Tc518.KN/APawlewski, 1882Uncertainty assigned by TRC = 10. K; TRC

Enthalpy of vaporization

ΔvapH (kJ/mol) Temperature (K) Method Reference Comment
34.6259.AStephenson and Malanowski, 1987Based on data from 244. - 401. K.; AC

In addition to the Thermodynamics Research Center (TRC) data available from this site, much more physical and chemical property data is available from the following TRC products:

Reaction thermochemistry data

Data compiled by: Hussein Y. Afeefy, Joel F. Liebman, and Stephen E. Stein

Individual Reactions

Allyl ethyl ether = cis-1-Propenyl ethyl ether

By formula: C5H10O = C5H10O

Quantity Value Units Method Reference Comment
Δr-21.4 ± 0.6kJ/molEqkTaskinen, 1993liquid phase; solvent: DMSO; Isomerization

Gas phase ion energetics data

Data evaluated by: Edward P. Hunter and Sharon G. Lias

Quantity Value Units Method Reference Comment
Proton affinity (review)833.7kJ/molN/AHunter and Lias, 1998
Quantity Value Units Method Reference Comment
Gas basicity804.5kJ/molN/AHunter and Lias, 1998

Kovats' RI, non-polar column, isothermal

View large format table.

Column type Active phase Temperature (C) I Reference Comment
PackedApiezon L120.567.Bogoslovsky, Anvaer, et al., 1978Celite 545
PackedApiezon L160.570.Bogoslovsky, Anvaer, et al., 1978Celite 545
PackedApiezon M130.567.Golovnya, Misharina, et al., 1978Chromosorb W, AW-DMCS; Column length: 2.1 m

Normal alkane RI, non-polar column, isothermal

View large format table.

Column type Active phase Temperature (C) I Reference Comment
PackedApieson L120.571.Kurdina, Markovich, et al., 1969not specified, not specified

Normal alkane RI, non-polar column, custom temperature program

View large format table.

Column type Active phase I Reference Comment
CapillarySE-30586.Vinogradov, 2004Program: not specified

References

Weast and Grasselli, 1989
CRC Handbook of Data on Organic Compounds, 2nd Editon, Weast,R.C and Grasselli, J.G., ed(s)., CRC Press, Inc., Boca Raton, FL, 1989, 1. [all data]

American Tokyo Kasei, 1988
American Tokyo Kasei, TCI American Organic Chemical 88/89 Catalog, American Tokyo Kasei, Portland, OR, 1988, 1610. [all data]

Katritzky, Pinzelli, et al., 1970
Katritzky, A.R.; Pinzelli, R.F.; Sinnot, M.V.; Topsom, R.D., Infrared INtensities as a Quantitative Measure of Intramoelcular Inter- actions XV. Monosubstituted Ethylenes, J. Am. Chem. Soc., 1970, 92, 6861. [all data]

Pawlewski, 1882
Pawlewski, B., The critical temperatures of ester compounds, Ber. Dtsch. Chem. Ges., 1882, 15, 2460-4. [all data]

Stephenson and Malanowski, 1987
Stephenson, Richard M.; Malanowski, Stanislaw, Handbook of the Thermodynamics of Organic Compounds, 1987, https://doi.org/10.1007/978-94-009-3173-2 . [all data]

Taskinen, 1993
Taskinen, E., Relative thermodynamic stabilities of isomeric alkyl allyl and alkyl (Z)-propenyl ethers, Tetrahedron, 1993, 49, 11389-11394. [all data]

Hunter and Lias, 1998
Hunter, E.P.; Lias, S.G., Evaluated Gas Phase Basicities and Proton Affinities of Molecules: An Update, J. Phys. Chem. Ref. Data, 1998, 27, 3, 413-656, https://doi.org/10.1063/1.556018 . [all data]

Bogoslovsky, Anvaer, et al., 1978
Bogoslovsky, Yu.N.; Anvaer, B.I.; Vigdergauz, M.S., Chromatographic constants in gas chromatography (in Russian), Standards Publ. House, Moscow, 1978, 192. [all data]

Golovnya, Misharina, et al., 1978
Golovnya, R.V.; Misharina, T.A.; Garbuzov, V.G., Gas chromatographic characterization of sulfur-containing compounds. 4. The effect of unsaturated radicals on the retention indices of the vinyl, allyl, and propargyl alkyl sulfides, Izv. Akad. Nauk SSSR Ser. Khim., 1978, 11, 2266-2270. [all data]

Kurdina, Markovich, et al., 1969
Kurdina, Z.G.; Markovich, V.E.; Sakharov, V.M., Gas chromatography of cyclic O-containing compounds in Gas chromatography, Issue # 10, NIITEKhim, Moscow, 1969, 128-133. [all data]

Vinogradov, 2004
Vinogradov, B.A., Production, composition, properties and application of essential oils, 2004, retrieved from http://viness.narod.ru. [all data]