L-Alanine,N-[N-(1-oxodecyl)-L-α-glutamyl]-dimethyl ester

Gas phase ion energetics data

Data compiled by: Sharon G. Lias, Rhoda D. Levin, and Sherif A. Kafafi

Ionization energy determinations

IE (eV) Method Reference
9.1 ± 0.1PIOrlov, Varshavsky, et al., 1974

Appearance energy determinations

Ion AE (eV) Other Products MethodReferenceComment
C15H28NO3+9.6 ± 0.1?PIOrlov, Varshavsky, et al., 1974
C15H29NO3+9.4 ± 0.1?PIOrlov, Varshavsky, et al., 1974
C16H28NO4+9.7 ± 0.1?PIOrlov, Varshavsky, et al., 1974

References

Orlov, Varshavsky, et al., 1974
Orlov, V.M.; Varshavsky, Y.M.; Miroshnikov, A.I., Photoionisation mass spectra of volatile derivatives of short peptides and appearance potentials of their characteristic ions, Org. Mass Spectrom., 1974, 9, 811. [all data]