1,2-Dithiolane

Reaction thermochemistry data

Data compiled by: Hussein Y. Afeefy, Joel F. Liebman, and Stephen E. Stein

Individual Reactions

1,3-Propanedithiol + Iodine = 2Hydrogen iodide + 1,2-Dithiolane

By formula: C3H8S2 + I2 = 2HI + C3H6S2

Quantity Value Units Method Reference Comment
Δr-107.7kJ/molCmSunner, 1955liquid phase; solvent: Ethanol/water(90/10)

Gas phase ion energetics data

Data compiled as indicated in comments:
LLK - Sharon G. Lias, Rhoda D. Levin, and Sherif A. Kafafi

Ionization energy determinations

IE (eV) Method Reference Comment
7.6PEBock, Stein, et al., 1980LLK
8.25PEBock, Stein, et al., 1980Vertical value; LLK

References

Sunner, 1955
Sunner, S., Strain in 6,8-thioctic acid, Nature (London), 1955, 176, 217. [all data]

Bock, Stein, et al., 1980
Bock, H.; Stein, U.; Semkov, A., 1,2-Dithiolan - bindungsmodell fur α-liponsaure, Chem. Ber., 1980, 113, 3208. [all data]

Bergson and Schotte, 1962
Bergson, G.; Schotte, L., Acta Chem. Scand., 1962, 16, 1159. [all data]