Butanoic acid, 3-methyl-, propyl ester

Normal alkane RI, polar column, temperature ramp

Data compiled by: NIST Mass Spectrometry Data Center, William E. Wallace, director

Column type CapillaryCapillaryCapillary
Active phase Supelcowax-10InnowaxCarbowax 20M
Column length (m) 10.60.80.
Carrier gas HeHe
Substrate
Column diameter (mm) 0.10.250.2
Phase thickness (μm) 0.1
Tstart (C) 40.60.70.
Tend (C) 240.220.170.
Heat rate (K/min) 50.4.2.
Initial hold (min) 1.510.
Final hold (min) 2.10.
I 1140.1167.1144.
ReferenceChin, Nazimah, et al., 2007Suleimenov, Atazharova, et al., 2003Anker, Jurs, et al., 1990
Comment MSDC-RI MSDC-RI MSDC-RI

Kovats' RI, non-polar column, temperature ramp

Data compiled by: NIST Mass Spectrometry Data Center, William E. Wallace, director

Column type Packed
Active phase Apiezon L
Column length (m) 1.2
Carrier gas
Substrate Chromosorb W HMDS HP (00-120 mesh)
Column diameter (mm)
Phase thickness (μm)
Tstart (C) 50.
Tend (C) 200.
Heat rate (K/min) 4.
Initial hold (min)
Final hold (min)
I 912.
ReferenceRasmussen, 1983
Comment MSDC-RI

References

Chin, Nazimah, et al., 2007
Chin, S.T.; Nazimah, S.A.H.; Quek, S.Y.; Che Man, Y.B.; Rahman, R.A.; Hashim, D.M., Analysis of volatile compounds from Malaysian durians (Durio zibethinus) using headspace SPME coupled to fast GC-MS, J. Food Comp. Anal., 2007, 20, 1, 31-44, https://doi.org/10.1016/j.jfca.2006.04.011 . [all data]

Suleimenov, Atazharova, et al., 2003
Suleimenov, E.M.; Atazharova, G.A.; Demirchi, B.; Baser, K.H.C.; Adekenov, S.M., Essential oil composition of Artemisia Lercheana and A. Sieversiana of Kazakhstan flora in Recent problems of development of new medicines of natural origin, Proceedings of symposium, St.Petersburg - Pushkin, 2003, 382-385. [all data]

Anker, Jurs, et al., 1990
Anker, L.S.; Jurs, P.C.; Edwards, P.A., Quantitative structure-retention relationship studies of odor-active aliphatic compounds with oxygen-containing functional groups, Anal. Chem., 1990, 62, 24, 2676-2684, https://doi.org/10.1021/ac00223a006 . [all data]