Heptacosanoic acid, methyl ester

Phase change data

Data compiled by: William E. Acree, Jr., James S. Chickos

Quantity Value Units Method Reference Comment
Δvap152.2 ± 4.5kJ/molCGCChickos, Zhao, et al., 2004Based on data from 467. - 558. K.

Enthalpy of fusion

ΔfusH (kJ/mol) Temperature (K) Method Reference
100.7336.2DSCChickos, Zhao, et al., 2004

Van Den Dool and Kratz RI, non-polar column, temperature ramp

View large format table.

Column type Active phase I Reference Comment
CapillaryDB-13014.Johnson, Urso, et al., 199730. m/0.2 mm/0.25 μm, 50. C @ 2. min, 5. K/min, 300. C @ 5. min

Normal alkane RI, non-polar column, temperature ramp

View large format table.

Column type Active phase I Reference Comment
CapillaryDB-1MS3015.64Stransky, Zarevucka, et al., 200630. m/0.252 mm/0.25 μm, H2, 1. K/min; Tstart: 240. C; Tend: 340. C
CapillaryDB-53027.da Camara, Shepherd, et al., 200230. m/0.25 mm/0.25 μm, He, 4. K/min; Tstart: 40. C; Tend: 290. C

Lee's RI, non-polar column, temperature ramp

View large format table.

Column type Active phase I Reference Comment
CapillaryDB-1491.0Johnson, Urso, et al., 199730. m/0.2 mm/0.25 μm, 50. C @ 2. min, 5. K/min, 300. C @ 5. min

References

Chickos, Zhao, et al., 2004
Chickos, James S.; Zhao, Hui; Nichols, Gary, The vaporization enthalpies and vapor pressures of fatty acid methyl esters C18, C21 to C23, and C25 to C29 by correlation -- gas chromatography, Thermochimica Acta, 2004, 424, 1-2, 111-121, https://doi.org/10.1016/j.tca.2004.05.020 . [all data]

Johnson, Urso, et al., 1997
Johnson, C.I.; Urso, A.; Geleta, L., Broad spectrum analysis of municipal and industrial effluents discharged into the Peace, Athabasca and Slave river basins: characterization of effluent samples, 1994 - Volume 1 of 2, Northern River Basins Study Project Report No. 121, Norther River Basins Study, Edmonton, Alberta, 1997, 27. [all data]

Stransky, Zarevucka, et al., 2006
Stransky, K.; Zarevucka, M.; Valterova, I.; Wimmer, Z., Gas chromatographic retention data of wax esters, J. Chromatogr. A, 2006, 1128, 1-2, 208-219, https://doi.org/10.1016/j.chroma.2006.06.035 . [all data]

da Camara, Shepherd, et al., 2002
da Camara, C.A.G.; Shepherd, S.L.K.; Joaquim, D.R.G., Análise químnica da cultura de tecidos do híbrido Clusia paralicola X Clusia weddelliana, Revista Brasileira de Farmacognosia, 2002, 12, 26-28, https://doi.org/10.1590/S0102-695X2002000300013 . [all data]