11,14,17-Eicosatrienoic acid, methyl ester

Normal alkane RI, non-polar column, temperature ramp

Data compiled by: NIST Mass Spectrometry Data Center, William E. Wallace, director

Column type Capillary
Active phase HP-101
Column length (m) 25.
Carrier gas He
Substrate
Column diameter (mm) 0.2
Phase thickness (μm) 0.2
Tstart (C) 70.
Tend (C) 200.
Heat rate (K/min) 3.
Initial hold (min) 2.
Final hold (min) 15.
I 2241.
ReferenceMastelic, Jerkovic, et al., 2006
Comment MSDC-RI

Kovats' RI, non-polar column, isothermal

View large format table.

Column type Active phase Temperature (C) I Reference Comment
CapillaryCP Sil 5 CB240.2275.Hanai and Hong, 198930. m/0.25 mm/0.25 μm
CapillaryDB-1240.2290.Hanai and Hong, 198930. m/0.25 mm/0.25 μm
PackedSE-30200.2279.Golovnya and Kuzmenko, 1977He, Chromosorb W (80-100 mesh); Column length: 1.5 m
PackedSE-30200.2279.Golovnya, Uralets, et al., 1976Gas Chrom Q (80-100 mesh); Column length: 1.5 m

References

Mastelic, Jerkovic, et al., 2006
Mastelic, J.; Jerkovic, I.; Mesic, M., Volatile constituents from flowers, leaves, bark and wood of Prunus mahaleb L., Flavour Fragr. J., 2006, 21, 2, 306-313, https://doi.org/10.1002/ffj.1596 . [all data]