Cyclononasiloxane, octadecamethyl-
- Formula: C18H54O9Si9
- Molecular weight: 667.3855
- IUPAC Standard InChIKey: ISXOGOLHEGHGQF-UHFFFAOYSA-N
- CAS Registry Number: 556-71-8
- Chemical structure:

Phase change data

Data compiled as indicated in comments:
TRC - Thermodynamics Research Center, NIST Boulder Laboratories, Chris Muzny director
AC - William E. Acree, Jr., James S. Chickos
Quantity | Value | Units | Method | Reference | Comment |
---|---|---|---|---|---|
Tfus | 250. | K | N/A | Alvik and Dale, 1971 | Uncertainty assigned by TRC = 1. K; TRC |
Enthalpy of vaporization
ΔvapH (kJ/mol) | Temperature (K) | Method | Reference | Comment |
---|---|---|---|---|
67.9 | 478. | A | Stephenson and Malanowski, 1987 | Based on data from 463. to 584. K.; AC |
68. | 488. | EB | Flaningam, 1986 | Based on data from 473. to 578. K.; AC |
Enthalpy of fusion
ΔfusH (kJ/mol) | Temperature (K) | Reference | Comment |
---|---|---|---|
25.64 | 246.2 | Alvik, Dale, et al., 1971 | AC |

Van Den Dool and Kratz RI, non-polar column, temperature ramp

Column type | Active phase | I | Reference | Comment |
---|---|---|---|---|
Capillary | Ultra-1 | 1858. | Richmond and Pombo-Villar, 1998 | 25. m/0.32 mm/0.52 μm, He, 15. K/min, 320. C @ 10. min; Tstart: 35. C |

Normal alkane RI, non-polar column, temperature ramp

Column type | Active phase | I | Reference | Comment |
---|---|---|---|---|
Capillary | Methyl Silicone | 1871. | Fujimoto, Ohtani, et al., 1990 | 25. m/0.25 mm/0.1 μm, He, 5. K/min; Tstart: 40. C; Tend: 350. C |

Normal alkane RI, non-polar column, custom temperature program

Column type | Active phase | I | Reference | Comment |
---|---|---|---|---|
Capillary | Ultra-1 | 1865. | Kazuyoshi, Seiichi, et al., 2000 | 30. m/0.25 mm/0.50 μm; Program: 40 0C (5 min) 10 0C/min -> 200 0C 20 0C/min -> 320 0C (13 min) |
Capillary | Ultra-1 | 1866. | Kazuyoshi, Seiichi, et al., 2000 | 30. m/0.25 mm/0.50 μm; Program: 40 0C (5 min) 10 0C/min -> 200 0C 20 0C/min -> 320 0C (13 min) |
Capillary | Ultra-1 | 1868. | Kazuyoshi, Seiichi, et al., 2000 | 30. m/0.25 mm/0.50 μm; Program: 40 0C (5 min) 10 0C/min -> 200 0C 20 0C/min -> 320 0C (13 min) |
Capillary | Ultra-1 | 1869. | Kazuyoshi, Seiichi, et al., 2000 | 30. m/0.25 mm/0.50 μm; Program: 40 0C (5 min) 10 0C/min -> 200 0C 20 0C/min -> 320 0C (13 min) |
Capillary | Ultra-1 | 1874. | Kazuyoshi, Seiichi, et al., 2000 | 30. m/0.25 mm/0.50 μm; Program: 40 0C (5 min) 10 0C/min -> 200 0C 20 0C/min -> 320 0C (13 min) |
Capillary | Ultra-1 | 1874. | Kazuyoshi, Seiichi, et al., 2000 | 30. m/0.25 mm/0.50 μm; Program: 40 0C (5 min) 10 0C/min -> 200 0C 20 0C/min -> 320 0C (13 min) |
Capillary | Ultra-1 | 1855. | Richmond and Pombo-Villar, 1998 | 25. m/0.32 mm/0.52 μm, He; Program: not specified |

References

Alvik and Dale, 1971
Alvik, T.; Dale, J.,
On the Lack of Conformational Preferences for Cyclic Dimethylsiloxane Oligomers.,
Acta Chem. Scand., 1971, 25, 2131, https://doi.org/10.3891/acta.chem.scand.25-2131
. [all data]
Stephenson and Malanowski, 1987
Stephenson, Richard M.; Malanowski, Stanislaw,
Handbook of the Thermodynamics of Organic Compounds, 1987, https://doi.org/10.1007/978-94-009-3173-2
. [all data]
Flaningam, 1986
Flaningam, Ora L.,
Vapor pressures of poly(dimethylsiloxane) oligomers,
J. Chem. Eng. Data, 1986, 31, 3, 266-272, https://doi.org/10.1021/je00045a002
. [all data]
Alvik, Dale, et al., 1971
Alvik, Thor; Dale, Johannes; Fernholt, L.; Hedberg, Kenneth; Schaumburg, Kjeld; Ehrenberg, L.,
On the Lack of Conformational Preferences for Cyclic Dimethylsiloxane Oligomers.,
Acta Chem. Scand., 1971, 25, 2131-2141, https://doi.org/10.3891/acta.chem.scand.25-2131
. [all data]
Richmond and Pombo-Villar, 1998
Richmond, R.; Pombo-Villar, E.,
Short communication. Use of persistent trace gas chromatography artifacts for the calculation of pseudo-Sadtler retention indices,
J. Chromatogr. A, 1998, 811, 1-2, 241-245, https://doi.org/10.1016/S0021-9673(98)00285-4
. [all data]
Fujimoto, Ohtani, et al., 1990
Fujimoto, S.; Ohtani, H.; Yamagiwa, K.; Tsuge, S.,
Study on retention behavior of cyclic siloxanes by high resolution pyrolysis-gas chromatography with a fused silica capillary column,
J. Hi. Res. Chromatogr., 1990, 13, 6, 397-404, https://doi.org/10.1002/jhrc.1240130603
. [all data]
Kazuyoshi, Seiichi, et al., 2000
Kazuyoshi, N.; Seiichi, Y.; Kazuo, K.; Katsumi, I.; Okihiko, S.,
Polymer analysis by improved pyrolysis gas chromatography hyphenated with four specific detectors,
J. Soc. Cosmet. Chem. Jpn., 2000, 34, 2, 142-151, https://doi.org/10.5107/sccj.34.142
. [all data]