Cyclooctasiloxane, hexadecamethyl-

Phase change data

Data compiled as indicated in comments:
TRC - Thermodynamics Research Center, NIST Boulder Laboratories, Chris Muzny director
AC - William E. Acree, Jr., James S. Chickos

Quantity Value Units Method Reference Comment
Tfus242.KN/AAlvik and Dale, 1971Uncertainty assigned by TRC = 0.1 K; TRC

Enthalpy of vaporization

ΔvapH (kJ/mol) Temperature (K) Method Reference Comment
66.6391.AStephenson and Malanowski, 1987Based on data from 378. - 563. K.; AC
64.5469.EBFlaningam, 1986Based on data from 454. - 576. K.; AC

In addition to the Thermodynamics Research Center (TRC) data available from this site, much more physical and chemical property data is available from the following TRC products:

Normal alkane RI, non-polar column, temperature ramp

Data compiled by: NIST Mass Spectrometry Data Center, William E. Wallace, director

Column type CapillaryCapillary
Active phase SP-2100Methyl Silicone
Column length (m) 30.25.
Carrier gas HeHe
Substrate
Column diameter (mm) 0.250.25
Phase thickness (μm)  0.1
Tstart (C) 40.40.
Tend (C) 280.350.
Heat rate (K/min) 5.5.
Initial hold (min) 3.
Final hold (min)
I 1688.1709.
ReferenceFischer and Kusch, 1993Fujimoto, Ohtani, et al., 1990
Comment MSDC-RI MSDC-RI

Van Den Dool and Kratz RI, non-polar column, temperature ramp

Data compiled by: NIST Mass Spectrometry Data Center, William E. Wallace, director

Column type Capillary
Active phase Ultra-1
Column length (m) 25.
Carrier gas He
Substrate
Column diameter (mm) 0.32
Phase thickness (μm) 0.52
Tstart (C) 35.
Tend (C) 320.
Heat rate (K/min) 15.
Initial hold (min)
Final hold (min) 10.
I 1693.
ReferenceRichmond and Pombo-Villar, 1998
Comment MSDC-RI

References

Alvik and Dale, 1971
Alvik, T.; Dale, J., On the Lack of Conformational Preferences for Cyclic Dimethylsiloxane Oligomers., Acta Chem. Scand., 1971, 25, 2131, https://doi.org/10.3891/acta.chem.scand.25-2131 . [all data]

Stephenson and Malanowski, 1987
Stephenson, Richard M.; Malanowski, Stanislaw, Handbook of the Thermodynamics of Organic Compounds, 1987, https://doi.org/10.1007/978-94-009-3173-2 . [all data]

Flaningam, 1986
Flaningam, Ora L., Vapor pressures of poly(dimethylsiloxane) oligomers, J. Chem. Eng. Data, 1986, 31, 3, 266-272, https://doi.org/10.1021/je00045a002 . [all data]