4'-(5-Hexenyloxy)-[1,1'-biphenyl]-4-thiol

Phase change data

Data compiled by: William E. Acree, Jr., James S. Chickos

Enthalpy of fusion

ΔfusH (kJ/mol) Temperature (K) Method Reference
13.6384.6DSCWilderbeek, van der Meer, et al., 2003

References

Wilderbeek, van der Meer, et al., 2003
Wilderbeek, H.T.A.; van der Meer, M.G.M.; Jansen, M.A.G.; Nelissen, L.; Fischer, H.R.; van Es, J.J.G.S.; Bastiaansen, C.W.M.; Lub, J.; Broer, D.J., Synthesis and properties of phenyl benzoate-based and biphenyl-based liquid crystalline thiol-ene monomers, Liquid Crystals, 2003, 30, 1, 93-108, https://doi.org/10.1080/0267829021000001746 . [all data]