Hydrazine, (phenylmethyl)-

Gas phase ion energetics data

Data compiled by: Henry M. Rosenstock, Keith Draxl, Bruce W. Steiner, and John T. Herron

Ionization energy determinations

IE (eV) Method Reference
8.64PEBodor, Dewar, et al., 1970

Normal alkane RI, non-polar column, temperature ramp

View large format table.

Column type Active phase I Reference Comment
CapillaryHP-5 MS1118.Miyazawa, Marumoto, et al., 201130. m/0.25 mm/0.25 μm, Helium, 4. K/min, 260. C @ 5. min; Tstart: 40. C

References

Bodor, Dewar, et al., 1970
Bodor, N.; Dewar, M.J.S.; Jennings, W.B.; Worley, S.D., Photoelectron spectra of molecules-IV.Ionization potentials and heats of formation of some hydrazines and amines, Tetrahedron, 1970, 26, 4109. [all data]

Miyazawa, Marumoto, et al., 2011
Miyazawa, M.; Marumoto, S.; Kobayashi, T.; Yoshida, S.; Utsumi, Y., Determination of characteristic components in essential oils from Wisteria braphybotrys using gas chromatography - olfactometry incremental dilution technique, Rec. Nat. Prod., 2011, 5, 3, 221-227. [all data]