(1α,2β,4β,5α) 6,7-Diazatricyclo[3.2.2.0(3,4)]nona-6,8-diene N-oxide

Reaction thermochemistry data

Data compiled by: Hussein Y. Afeefy, Joel F. Liebman, and Stephen E. Stein

Individual Reactions

C7H8N2O = Nitrous oxide + Norcaradiene

By formula: C7H8N2O = N2O + C7H8

Quantity Value Units Method Reference Comment
Δr-68.5 ± 3.6kJ/molKinOth, Olsen, et al., 1977liquid phase; solvent: THF; At 337K

References

Oth, Olsen, et al., 1977
Oth, J.F.M.; Olsen, H.; Synder, J.P., Energetics of heteroextrusion reactions. N2 vs. N2O, J. Am. Chem. Soc., 1977, 99, 8505-8507. [all data]