Crotonylglycine, TMS

Van Den Dool and Kratz RI, non-polar column, temperature ramp

View large format table.

Column type Active phase I Reference Comment
PackedOV-11513.Ramsdell and Tanaka, 1980N2, Anakrom, 4. K/min; Column length: 2. m; Tstart: 80. C
PackedOV-11482.Tanaka, Hine, et al., 1980N2, 100-120 mesh, 70. C @ 0.5 min, 28. K/min; Column length: 1.8 m; Tend: 290. C
PackedOV-11513.Tanaka, Hine, et al., 1980N2, 100-120 mesh, 70. C @ 0.5 min, 28. K/min; Column length: 1.8 m; Tend: 290. C

Van Den Dool and Kratz RI, non-polar column, custom temperature program

View large format table.

Column type Active phase I Reference Comment
PackedOV-1011513.Tanaka and Hine, 1982Program: not specified

Normal alkane RI, non-polar column, temperature ramp

View large format table.

Column type Active phase I Reference Comment
CapillaryHP-5MS1546.Lee, Yanamandra, et al., 200230. m/0.25 mm/0.25 μm, He, 70. C @ 3. min, 4. K/min, 280. C @ 3. min

References

Ramsdell and Tanaka, 1980
Ramsdell, H.S.; Tanaka, K., Gas chromatographic retention indices of twenty metabolically important acylglycines as trimethylsilyl derivatives, J. Chromatogr., 1980, 181, 1, 90-94, https://doi.org/10.1016/S0378-4347(00)81273-6 . [all data]

Tanaka, Hine, et al., 1980
Tanaka, K.; Hine, D.G.; West-Dull, A.; Lynn, T.B., Gas-chromatographic method of analysis for urinary organic acids. I. Retention indices of 155 metabolically important compounds, Clin. Chem., 1980, 26, 13, 1839-1846. [all data]

Tanaka and Hine, 1982
Tanaka, K.; Hine, D.G., Compilation of Gas Chromatographic Retention Indices of 163 Metabolically Important Organic Acids, and Their Use in Detection of Patients with Organic Acidurias, J. Chromatogr., 1982, 239, 301-322, https://doi.org/10.1016/S0021-9673(00)81990-1 . [all data]

Lee, Yanamandra, et al., 2002
Lee, B.Y.; Yanamandra, K.; Thurmon, T.F., Quantitative estimation of organic analytes with a capillary column, Am. Clin. Lab., 2002, May, 30-34. [all data]