Methylsuccinic acid, 2TMS derivative

Kovats' RI, non-polar column, isothermal

Data compiled by: NIST Mass Spectrometry Data Center, William E. Wallace, director

Column type Packed
Active phase OV-1
Column length (m) 2.
Carrier gas N2
Substrate Chromosorb G (100-120 mesh)
Column diameter (mm)
Phase thickness (μm)
Temperature (C) 160.
I 1307.
ReferencePetersson, 1977
Comment MSDC-RI

Van Den Dool and Kratz RI, non-polar column, custom temperature program

Data compiled by: NIST Mass Spectrometry Data Center, William E. Wallace, director

Column type CapillaryCapillaryPacked
Active phase VF-5MSDB-1OV-101
Column length (m) 30.
Carrier gas HeHe
Substrate
Column diameter (mm) 0.25
Phase thickness (μm) 0.25
Program Multi-step temperature program; T(initial)=60C; T(final)=270Cnot specifiednot specified
I 1321.61323.1325.
ReferenceTret'yakov, 2008Tsai, Oliphant, et al., 1985Tanaka and Hine, 1982
Comment MSDC-RI MSDC-RI MSDC-RI

References

Petersson, 1977
Petersson, G., Retention Data in GLC Analysis; Carbohydrate-Related Hydroxy Carboxylic and Dicarboxylic Acids as Trimethylsilyl Derivatives, J. Chromatogr. Sci., 1977, 15, 7, 245-255, https://doi.org/10.1093/chromsci/15.7.245 . [all data]