Glycine, N-(1-oxopropyl)-N-(trimethylsilyl)-, trimethylsilyl ester

Van Den Dool and Kratz RI, non-polar column, temperature ramp

Data compiled by: NIST Mass Spectrometry Data Center, William E. Wallace, director

Column type CapillaryCapillaryCapillaryCapillaryCapillary
Active phase CP Sil 5 CBDB-5OV-1SE-52SE-52
Column length (m) 25.30.10.25.25.
Carrier gas  HeHeHeHe
Substrate
Column diameter (mm) 0.150.250.220.320.20
Phase thickness (μm) 0.121.0.170.520.40
Tstart (C) 90.100.70.70.50.
Tend (C) 270.290.270.270.270.
Heat rate (K/min) 10.4.5.5.5.
Initial hold (min) 1.4.
Final hold (min) 7.10.
I 1420.1428.1421.1422.1373.
ReferenceHalket, Przyborowska, et al., 1999Kimura, Yamamoto, et al., 1999Lefevere, Verhaeghe, et al., 1989Lefevere, Verhaeghe, et al., 1989Lefevere, Verhaeghe, et al., 1988
Comment MSDC-RI MSDC-RI MSDC-RI MSDC-RI MSDC-RI
Column type PackedPacked
Active phase OV-1OV-1
Column length (m) 2.1.8
Carrier gas N2N2
Substrate Anakrom100-120 mesh
Column diameter (mm)
Phase thickness (μm)
Tstart (C) 80.70.
Tend (C)  290.
Heat rate (K/min) 4.28.
Initial hold (min)  0.5
Final hold (min)
I 1417.1417.
ReferenceRamsdell and Tanaka, 1980Tanaka, Hine, et al., 1980
Comment MSDC-RI MSDC-RI

References

Halket, Przyborowska, et al., 1999
Halket, J.N.; Przyborowska, A.; Stein, S.E.; Mallard, W.G.; Down, S.; Chalmers, R., Deconvolution gas chromatography / mass spectrometry of urinary organic acids - potential for pattern recognition and automated identification of metabolic disorders, Rapid Commun. Mass spectrom., 1999, 13, 4, 279-284, https://doi.org/10.1002/(SICI)1097-0231(19990228)13:4<279::AID-RCM478>3.0.CO;2-I . [all data]

Kimura, Yamamoto, et al., 1999
Kimura, M.; Yamamoto, T.; Yamaguchi, S., Automated metabolic profiling and interpretation of GC/MS data for organic acidemia screening: a personal computer-based system, Tohoku J. Exp. Med., 1999, 188, 4, 317-334, https://doi.org/10.1620/tjem.188.317 . [all data]

Lefevere, Verhaeghe, et al., 1989
Lefevere, M.F.; Verhaeghe, B.J.; Declerck, D.H.; Van Bocxlaer, J.F.; De Leenheer, A.P.; De Sagher, R.M., Metabolic Profiling of Urinary Organic Acids by Single and Multicolumn Capillary Gas Chromatography, J. Chromatogr. Sci., 1989, 27, 1, 23-29, https://doi.org/10.1093/chromsci/27.1.23 . [all data]

Lefevere, Verhaeghe, et al., 1988
Lefevere, M.F.; Verhaeghe, B.J.; Declerck, D.M.; de Leenheer, A.P., Automated profiling of urinary organic acids by dual-column gas chromatography and gas chromatography/mass spectrometry, Biomed. Environ. Mass Spectrom., 1988, 15, 6, 311-322, https://doi.org/10.1002/bms.1200150603 . [all data]

Ramsdell and Tanaka, 1980
Ramsdell, H.S.; Tanaka, K., Gas chromatographic retention indices of twenty metabolically important acylglycines as trimethylsilyl derivatives, J. Chromatogr., 1980, 181, 1, 90-94, https://doi.org/10.1016/S0378-4347(00)81273-6 . [all data]

Tanaka, Hine, et al., 1980
Tanaka, K.; Hine, D.G.; West-Dull, A.; Lynn, T.B., Gas-chromatographic method of analysis for urinary organic acids. I. Retention indices of 155 metabolically important compounds, Clin. Chem., 1980, 26, 13, 1839-1846. [all data]