Neburon

Phase change data

Data compiled as indicated in comments:
TRC - Thermodynamics Research Center, NIST Boulder Laboratories, Chris Muzny director
AC - William E. Acree, Jr., James S. Chickos

Quantity Value Units Method Reference Comment
Tfus374.86KN/ADonnelly, Drewes, et al., 1990Uncertainty assigned by TRC = 0.2 K; TRC
Tfus374.6KN/APlato and Glasgow, 1969Uncertainty assigned by TRC = 0.2 K; TRC

Enthalpy of fusion

ΔfusH (kJ/mol) Temperature (K) Method Reference Comment
27.23374.3DSCDonnelly, Drewes, et al., 1990, 2AC

In addition to the Thermodynamics Research Center (TRC) data available from this site, much more physical and chemical property data is available from the following TRC products:

References

Donnelly, Drewes, et al., 1990
Donnelly, J.R.; Drewes, L.A.; Johnson, R.L.; Munslow, W.D.; Knapp, K.K.; Sovocool, G.W., Purity and heat of fusion data for environmental standards as determined by differential scanning calorimetry, Thermochim. Acta, 1990, 167, 2, 155, https://doi.org/10.1016/0040-6031(90)80476-F . [all data]

Plato and Glasgow, 1969
Plato, C.; Glasgow, A.R., Jr., Differential scanning calorimetry as a general method for determining the purity and heat of fusion of high-purity organic chemicals. Application to 95 compounds, Anal. Chem., 1969, 41, 2, 330, https://doi.org/10.1021/ac60271a041 . [all data]

Donnelly, Drewes, et al., 1990, 2
Donnelly, J.R.; Drewes, L.A.; Johnson, R.L.; Munslow, W.D.; Knapp, K.K.; Sovocool, G.W., Purity and heat of fusion data for environmental standards as determined by differential scanning calorimetry, Thermochimica Acta, 1990, 167, 2, 155-187, https://doi.org/10.1016/0040-6031(90)80476-F . [all data]