Silane,2,3-dimethyl-2-butene-1,4-diyl)bis[trimethyl-z-

Gas phase ion energetics data

Data compiled by: Sharon G. Lias, Rhoda D. Levin, and Sherif A. Kafafi

Ionization energy determinations

IE (eV) Method Reference Comment
7.70PEBock and Kaim, 1980Vertical value

References

Bock and Kaim, 1980
Bock, H.; Kaim, W., Radical ions. 37. Ionization and one-electron oxidation of electron-rich silylalkyl olefins, J. Am. Chem. Soc., 1980, 102, 4429. [all data]