Arachidic acid, TMS derivative

Normal alkane RI, non-polar column, temperature ramp

Data compiled by: NIST Mass Spectrometry Data Center, William E. Wallace, director

Column type CapillaryCapillaryCapillary
Active phase RTX-5 Sil MSHP-5HP-5
Column length (m) 30.30.30.
Carrier gas HeliumHeliumHe
Substrate
Column diameter (mm) 0.250.250.25
Phase thickness (μm) 0.250.250.25
Tstart (C) 70.50.50.
Tend (C) 310.300.300.
Heat rate (K/min) 5.3.5.
Initial hold (min) 5.
Final hold (min) 1.30.
I 2454.2447.2451.
ReferenceLytovchenko, Beleggia, et al., 2009Isidorov, Lech, et al., 2008Isidorov, Kotowska, et al., 2005
Comment MSDC-RI MSDC-RI MSDC-RI

Van Den Dool and Kratz RI, non-polar column, temperature ramp

Data compiled by: NIST Mass Spectrometry Data Center, William E. Wallace, director

Column type CapillaryCapillary
Active phase Ultra-1OV-1
Column length (m) 25.50.
Carrier gas  He
Substrate
Column diameter (mm) 0.320.30
Phase thickness (μm) 0.520.52
Tstart (C) 35.130.
Tend (C) 320.280.
Heat rate (K/min) 15.2.
Initial hold (min)
Final hold (min) 10.
I 2416.852437.
ReferenceRichmond and Pombo-Villar, 1997Harvey, 1989
Comment MSDC-RI MSDC-RI

References

Lytovchenko, Beleggia, et al., 2009
Lytovchenko, A.; Beleggia, R.; Schauer, N.; Isaacson, T.; Leuendorf, J.E.; Hellmann, H.; Rose, J.K.C.; Fernie, A.R., Application of GC-MS fpr the detection of lipophilic compounds in diverse plant tissues, Plant Methods, 2009, 5, 4, 1-11. [all data]

Isidorov, Lech, et al., 2008
Isidorov, V.A.; Lech, P.; Zolciak, A.; Rusak, N.; Szczepaniak, L., Gas Chromatographic - nass spectrometric investigation of metabolites from the needles and roots of pine seedlings at early stages of pathogenic fungi Armillaria ostoyae attack, Trees, 2008, 22, 4, 531-542, https://doi.org/10.1007/s00468-008-0213-z . [all data]

Isidorov, Kotowska, et al., 2005
Isidorov, V.A.; Kotowska, U.; Vinogorova, V.T., GC Identification of organic compounds based on partition coefficients of their TMS derivatives in a hexane-acetonitrile system and retention indices, Anal. Sci., 2005, 21, 12, 1483-1489, https://doi.org/10.2116/analsci.21.1483 . [all data]