Butanoic acid, 2,2-dimethyl-3-[(trimethylsilyl)oxy]-, trimethylsilyl ester

Van Den Dool and Kratz RI, non-polar column, temperature ramp

Data compiled by: NIST Mass Spectrometry Data Center, William E. Wallace, director

Column type Capillary
Active phase SE-52
Column length (m) 25.
Carrier gas He
Substrate
Column diameter (mm) 0.32
Phase thickness (μm) 0.52
Tstart (C) 70.
Tend (C) 270.
Heat rate (K/min) 5.
Initial hold (min)
Final hold (min)
I 1395.
ReferenceLefevere, Verhaeghe, et al., 1989
Comment MSDC-RI

References

Lefevere, Verhaeghe, et al., 1989
Lefevere, M.F.; Verhaeghe, B.J.; Declerck, D.H.; Van Bocxlaer, J.F.; De Leenheer, A.P.; De Sagher, R.M., Metabolic Profiling of Urinary Organic Acids by Single and Multicolumn Capillary Gas Chromatography, J. Chromatogr. Sci., 1989, 27, 1, 23-29, https://doi.org/10.1093/chromsci/27.1.23 . [all data]