Valeranone

Van Den Dool and Kratz RI, polar column, temperature ramp

Data compiled by: NIST Mass Spectrometry Data Center, William E. Wallace, director

Column type CapillaryCapillary
Active phase HP-InnowaxSupelcowax-10
Column length (m) 30.60.
Carrier gas HeHe
Substrate
Column diameter (mm) 0.250.25
Phase thickness (μm) 0.250.25
Tstart (C) 60.60.
Tend (C) 280.230.
Heat rate (K/min) 3.5.
Initial hold (min)  5.
Final hold (min)  20.
I 2128.2155.
ReferenceKundakovic, Fokialakis, et al., 2007Granicher, Christen, et al., 1995
Comment MSDC-RI MSDC-RI

References

Kundakovic, Fokialakis, et al., 2007
Kundakovic, T.; Fokialakis, N.; Kovacevic, N.; Chinou, I., Essential oil composition of Achillea lingulata and A. umbellata, Flavour Fragr. J., 2007, 22, 3, 184-187, https://doi.org/10.1002/ffj.1778 . [all data]

Granicher, Christen, et al., 1995
Granicher, F.; Christen, P.; Kapetanidis, I., Essential oils from normal and hairy roots of valeriana officinalis var. sambucifolia, Phytochemistry, 1995, 40, 5, 1421-1424, https://doi.org/10.1016/0031-9422(95)00492-P . [all data]