Gulonic acid, γ-lactone, 4TMS derivavative

Kovats' RI, non-polar column, isothermal

View large format table.

Column type Active phase Temperature (C) I Reference Comment
PackedOV-1160.1953.Petersson, 1977N2, Chromosorb G (100-120 mesh); Column length: 2. m

References

Petersson, 1977
Petersson, G., Retention Data in GLC Analysis; Carbohydrate-Related Hydroxy Carboxylic and Dicarboxylic Acids as Trimethylsilyl Derivatives, J. Chromatogr. Sci., 1977, 15, 7, 245-255, https://doi.org/10.1093/chromsci/15.7.245 . [all data]