Heptadecanoic acid, TMS derivative

Van Den Dool and Kratz RI, non-polar column, temperature ramp

Data compiled by: NIST Mass Spectrometry Data Center, William E. Wallace, director

Column type CapillaryCapillaryCapillary
Active phase DB-5HP-5OV-1
Column length (m) 30.25.50.
Carrier gas  HeHe
Substrate
Column diameter (mm) 0.250.310.30
Phase thickness (μm) 0.250.520.52
Tstart (C) 100.100.130.
Tend (C) 300.290.280.
Heat rate (K/min) 10.5.2.
Initial hold (min) 1.5.
Final hold (min) 15.15.
I 2148.2103.2140.
ReferenceOhie, Fu, et al., 2000Antoshechkin, Golovkin, et al., 1989Harvey, 1989
Comment MSDC-RI MSDC-RI MSDC-RI

Normal alkane RI, non-polar column, custom temperature program

Data compiled by: NIST Mass Spectrometry Data Center, William E. Wallace, director

Column type Capillary
Active phase HP-5
Column length (m) 30.
Carrier gas Helium
Substrate
Column diameter (mm) 0.25
Phase thickness (μm) 0.25
Program not specified
I 2152.
ReferenceIsidorov, Lech, et al., 2008
Comment MSDC-RI

References

Ohie, Fu, et al., 2000
Ohie, T.; Fu, X.; Iga, M.; Kimura, M.; Yamaguchi, S., Gas chromatography-mass spectrometry with tert .-butyldimethylsilyl derivatization: use of the simplified sample preparations and the automated data system to screen for organic acidemias, J. Chromatogr. B, 2000, 746, 1, 63-73, https://doi.org/10.1016/S0378-4347(00)00105-5 . [all data]

Antoshechkin, Golovkin, et al., 1989
Antoshechkin, A.G.; Golovkin, A.B.; Maximova, L.A.; Bakharev, V.A., Screening of amniotic fluid metabolites by gas chromatography-mass spectrometry, J. Chromatogr., 1989, 489, 2, 353-358, https://doi.org/10.1016/S0378-4347(00)82913-8 . [all data]

Harvey, 1989
Harvey, D.J., Identification of long-chain fatty acids and alcohols from human cerumen by the use of picolinyl and nicotinate esters, Biomed. Environ. Mass Spectrom., 1989, 18, 9, 719-723, https://doi.org/10.1002/bms.1200180912 . [all data]