Tiglyl glycine, 2TMS derivative

Van Den Dool and Kratz RI, non-polar column, temperature ramp

Data compiled by: NIST Mass Spectrometry Data Center, William E. Wallace, director

Column type CapillaryPackedPacked
Active phase SE-52OV-1OV-1
Column length (m) 25.2.1.8
Carrier gas HeN2N2
Substrate  Anakrom100-120 mesh
Column diameter (mm) 0.20
Phase thickness (μm) 0.40
Tstart (C) 50.80.70.
Tend (C) 270. 290.
Heat rate (K/min) 5.4.28.
Initial hold (min)   0.5
Final hold (min)
I 1579.1549.1549.
ReferenceLefevere, Verhaeghe, et al., 1988Ramsdell and Tanaka, 1980Tanaka, Hine, et al., 1980
Comment MSDC-RI MSDC-RI MSDC-RI

References

Lefevere, Verhaeghe, et al., 1988
Lefevere, M.F.; Verhaeghe, B.J.; Declerck, D.M.; de Leenheer, A.P., Automated profiling of urinary organic acids by dual-column gas chromatography and gas chromatography/mass spectrometry, Biomed. Environ. Mass Spectrom., 1988, 15, 6, 311-322, https://doi.org/10.1002/bms.1200150603 . [all data]

Ramsdell and Tanaka, 1980
Ramsdell, H.S.; Tanaka, K., Gas chromatographic retention indices of twenty metabolically important acylglycines as trimethylsilyl derivatives, J. Chromatogr., 1980, 181, 1, 90-94, https://doi.org/10.1016/S0378-4347(00)81273-6 . [all data]

Tanaka, Hine, et al., 1980
Tanaka, K.; Hine, D.G.; West-Dull, A.; Lynn, T.B., Gas-chromatographic method of analysis for urinary organic acids. I. Retention indices of 155 metabolically important compounds, Clin. Chem., 1980, 26, 13, 1839-1846. [all data]