2-Butenoic acid, 2-methyl-, ethyl ester

Normal alkane RI, polar column, custom temperature program

Data compiled by: NIST Mass Spectrometry Data Center, William E. Wallace, director

Column type Capillary
Active phase PEG-20M
Column length (m) 30.
Carrier gas
Substrate
Column diameter (mm) 0.25
Phase thickness (μm) 0.25
Program 50C(8min) => 4C/min => 110C => 16C/min => 200C
I 1229.
ReferenceGarruti, Franco, et al., 2003
Comment MSDC-RI

References

Garruti, Franco, et al., 2003
Garruti, D.S.; Franco, M.R.B.; da Silva, M.A.A.P.; Janzantti, N.S.; Alves, G.L., Evaluation of volatile flavour compounds from cashew apple (Anacardium occidentale L) juice by the Osme gas chromatography/olfactometry technique, J. Sci. Food Agric., 2003, 83, 14, 1455-1462, https://doi.org/10.1002/jsfa.1560 . [all data]