β-Phellandrene

Van Den Dool and Kratz RI, non-polar column, temperature ramp

Data compiled by: NIST Mass Spectrometry Data Center, William E. Wallace, director

Column type CapillaryCapillaryCapillaryCapillaryCapillary
Active phase CP-Sil PONA GBBP-1DB-5DB-5RTX-1
Column length (m) 100.50.30.30.60.
Carrier gas HeHeHe He
Substrate
Column diameter (mm) 0.250.220.250.220.22
Phase thickness (μm) 0.250.250.250.250.25
Tstart (C) 140.60.60.60.60.
Tend (C) 230.220.240.240.230.
Heat rate (K/min) 5.2.3.3.2.
Initial hold (min) 10.  2.
Final hold (min) 25.20.  30.
I 1030.1023.1033.1029.1020.
ReferenceCunicao, Lopes, et al., 2007Duquesnoy, Castola, et al., 2007Maccioni, Baldini, et al., 2007Martins, Santos, et al., 2007Muselli, Rossi, et al., 2007
Comment MSDC-RI MSDC-RI MSDC-RI MSDC-RI MSDC-RI
Column type CapillaryCapillaryCapillaryCapillaryCapillary
Active phase RTX-1SPB-1HP-5MSEquity-5HP-5MS
Column length (m) 60.30.30.60.30.
Carrier gas HeHeHeHeHe
Substrate
Column diameter (mm) 0.220.250.250.250.25
Phase thickness (μm) 0.250.250.251.0.25
Tstart (C) 60.50.60.40.60.
Tend (C) 230.250.280.260.280.
Heat rate (K/min) 2.5.4.5.4.
Initial hold (min)  3.5.1.5.
Final hold (min) 35.15. 15.
I 1020.1050.1028.1058.1041.
ReferencePaolini, Muselli, et al., 2007Radulovic, Lazarevic, et al., 2007Radulovic, Lazarevic, et al., 2007Rocha, Coelho, et al., 2007Saroglou, Arfan, et al., 2007
Comment MSDC-RI MSDC-RI MSDC-RI MSDC-RI MSDC-RI
Column type CapillaryCapillaryCapillaryCapillaryCapillary
Active phase HP-5MSHP-5MSBP-1DB-5RTX-1
Column length (m) 30.30.50.30.60.
Carrier gas HeHeHe He
Substrate
Column diameter (mm) 0.250.250.220.250.22
Phase thickness (μm) 0.250.250.251.0.25
Tstart (C) 60.60.60.50.60.
Tend (C) 280.280.220.290.230.
Heat rate (K/min) 3.3.2.10.2.
Initial hold (min)    1.
Final hold (min)   20.10.45.
I 1035.1027.1020.1062.1024.
ReferenceVagionas, Ngassapa, et al., 2007Basta, Tzakou, et al., 2006Boti, Bighelli, et al., 2006Bylaite and Meyer, 2006Cavalli, Tomi, et al., 2006
Comment MSDC-RI MSDC-RI MSDC-RI MSDC-RI MSDC-RI
Column type CapillaryCapillaryCapillaryCapillaryCapillary
Active phase HP-5BP-1HP-5MSHP-5SPB-1
Column length (m) 30.50.30.30.30.
Carrier gas N2HeHeHeHe
Substrate
Column diameter (mm) 0.250.220.250.250.25
Phase thickness (μm) 0.250.250.250.250.25
Tstart (C) 60.60.60.60.50.
Tend (C) 220.220.280.250.250.
Heat rate (K/min) 5.2.3.10.5.
Initial hold (min) 10.  2.3.
Final hold (min)  20. 10.15.
I 1034.1025.1028.1036.1043.
ReferenceFlamini, Tebano, et al., 2006Gonny, Cavaleiro, et al., 2006Kukic J., Petrovic S., et al., 2006Liu J.M., Nan P., et al., 2006Radulovic, Mananjarasoa, et al., 2006
Comment MSDC-RI MSDC-RI MSDC-RI MSDC-RI MSDC-RI
Column type CapillaryCapillaryCapillaryCapillaryCapillary
Active phase DB-5DB-5HP-5BP-1SE-54
Column length (m) 30.30.30.50.50.
Carrier gas HeHeHeHeH2
Substrate
Column diameter (mm) 0.250.250.250.220.25
Phase thickness (μm) 0.250.250.250.250.27
Tstart (C) 50.50.40.60.50.
Tend (C) 250.250.300.220.300.
Heat rate (K/min) 5.5.4.2.5.
Initial hold (min) 2.2.5.
Final hold (min)    20.
I 1030.1030.1026.1022.1026.
ReferenceSu, Ho, et al., 2006Su, Ho, et al., 2006, 2Vundac, Pfeifhofer, et al., 2006Boti J.B., Koukoua G., et al., 2005Brantner, Pfeifhofer, et al., 2005
Comment MSDC-RI MSDC-RI MSDC-RI MSDC-RI MSDC-RI
Column type CapillaryCapillaryCapillaryCapillaryCapillary
Active phase RTX-1DB-1BP-1HP-5DB-1
Column length (m) 60.30.50.30.30.
Carrier gas  HeHeN2He
Substrate
Column diameter (mm) 0.220.250.220.250.25
Phase thickness (μm) 0.250.250.250.250.25
Tstart (C) 60.40.60.60.40.
Tend (C) 220.250.220.220.250.
Heat rate (K/min) 2.3.2.5.3.
Initial hold (min)    10.
Final hold (min) 20.20.20. 20.
I 1022.1010.1020.1034.1014.
ReferenceCozzani, Muselli, et al., 2005Fanciullino, Gancel, et al., 2005Ferrari, Tomi, et al., 2005Flamini, Luigi Cioni, et al., 2005Gancel, Ollitrault, et al., 2005
Comment MSDC-RI MSDC-RI MSDC-RI MSDC-RI MSDC-RI
Column type CapillaryCapillaryCapillaryCapillaryCapillary
Active phase CP Sil 5 CBDB-1RTX-1HP-5MSDB-1
Column length (m) 50.25.60.60.30.
Carrier gas H2 HeHeN2
Substrate
Column diameter (mm) 0.220.250.220.20.25
Phase thickness (μm) 0.130.250.250.250.25
Tstart (C) 40.60.60.60.50.
Tend (C) 300.180.230.200.200.
Heat rate (K/min) 4.3.2.2.5.
Initial hold (min)  10.
Final hold (min) 10.10.35.10.
I 1018.1030.1020.1030.1021.
ReferenceIdzojtic, Kajba, et al., 2005bin Jantan, Yalvema, et al., 2005Paolini, Costa, et al., 2005Smadja, Rondeau, et al., 2005Tchoumbougnang, Zollo, et al., 2005
Comment MSDC-RI MSDC-RI MSDC-RI MSDC-RI MSDC-RI
Column type CapillaryCapillaryCapillaryCapillaryCapillary
Active phase SPB-1HP-5HP-5SPB-1HP-5
Column length (m) 30.30.30.30.30.
Carrier gas HeN2N2He
Substrate
Column diameter (mm) 0.250.250.250.20.25
Phase thickness (μm) 0.250.250.250.20.25
Tstart (C) 70.60.60.70.60.
Tend (C) 220.220.220.220.220.
Heat rate (K/min) 3.5.5.3.5.
Initial hold (min)  10.10. 10.
Final hold (min) 15.  15.
I 1020.1037.1037.1020.1033.
ReferenceAntunes, Sevinate-Pinto, et al., 2004Bertoli, Menichini, et al., 2004Bertoli, Pistelli, et al., 2004Cavaleiro, Salgueiro, et al., 2004Ceccarini, Macchia, et al., 2004
Comment MSDC-RI MSDC-RI MSDC-RI MSDC-RI MSDC-RI
Column type CapillaryCapillaryCapillaryCapillaryCapillary
Active phase HP-5BP-1HP-5HP-5MSDB-5MS
Column length (m) 30.50.30.30.30.
Carrier gas He HeHeHe
Substrate
Column diameter (mm) 0.250.220.250.250.25
Phase thickness (μm) 0.250.25 0.250.25
Tstart (C) 60.60.60.60.40.
Tend (C) 240.220.260.280.280.
Heat rate (K/min) 3.2.3.4.4.
Initial hold (min)    5.2.
Final hold (min)  20.
I 1033.1022.1027.1036.1029.
ReferenceFlamini, Bader, et al., 2004Gonny, Bradesi, et al., 2004Javidnia, Miri, et al., 2004Karioti, Hadjipavlou-Litina, et al., 2004Mardarowicz, Wianowska, et al., 2004
Comment MSDC-RI MSDC-RI MSDC-RI MSDC-RI MSDC-RI
Column type CapillaryCapillaryCapillaryCapillaryCapillary
Active phase HP-5MSHP-5DB-5MSDB-5MSDB-5
Column length (m) 30.50.30.30.30.
Carrier gas HeHeHeHeN2
Substrate
Column diameter (mm) 0.250.20.250.250.25
Phase thickness (μm) 0.250.20.250.250.25
Tstart (C) 50.40.40.40.60.
Tend (C) 300.250.200.200.220.
Heat rate (K/min) 5.3.4.4.5.
Initial hold (min) 5.15.5.5.10.
Final hold (min)  40.20.20.
I 1028.1031.1052.1053.1033.
ReferenceMumm, Tiemann, et al., 2004Stashenko, Jaramillo, et al., 2004Yu, Kim, et al., 2004Yu, Kim, et al., 2004Bader, Caponi, et al., 2003
Comment MSDC-RI MSDC-RI MSDC-RI MSDC-RI MSDC-RI
Column type CapillaryCapillaryCapillaryCapillaryCapillary
Active phase DB-1SPB-1RTX-1Ultra-2DB-1
Column length (m) 30.30.60.25.30.
Carrier gas HeHeHeH2He
Substrate
Column diameter (mm) 0.250.20.220.250.25
Phase thickness (μm) 0.250.20.250.330.25
Tstart (C) 40.70.60.40.40.
Tend (C) 250.220.230.280.250.
Heat rate (K/min) 3.3.2.3.2.
Initial hold (min)    2.5.
Final hold (min) 20.15.45.10.
I 1010.1020.1022.1031.1018.
ReferenceBrat, Rega, et al., 2003Cavaleiro, Salgueiro, et al., 2003Cavalli, Tomi, et al., 2003Ceva-Antunes, Bizzo, et al., 2003de Feo, Urrunaga Soria, et al., 2003
Comment MSDC-RI MSDC-RI MSDC-RI MSDC-RI MSDC-RI
Column type CapillaryCapillaryCapillaryCapillaryCapillary
Active phase HP-5DB-1DB-5HP-5DB-5
Column length (m) 30.30.30.30.30.
Carrier gas N2He  He
Substrate
Column diameter (mm) 0.250.250.320.250.25
Phase thickness (μm) 0.250.250.5 0.25
Tstart (C) 60.40.40.25.75.
Tend (C) 220.250.265.150.230.
Heat rate (K/min) 5.3.7.3.3.
Initial hold (min) 10.  5.10.
Final hold (min)  20.5. 20.
I 1033.1014.1053.1031.1031.
ReferenceFlamini, Luigi Cioni, et al., 2003Gancel, Ollitrault, et al., 2003Högnadóttir and Rouseff, 2003Isidorov, Vinogorova, et al., 2003Jantan, Ling, et al., 2003
Comment MSDC-RI MSDC-RI MSDC-RI MSDC-RI MSDC-RI
Column type CapillaryCapillaryCapillaryCapillaryCapillary
Active phase HP-5MS5DB-5HP-5Mega 5MS
Column length (m) 30.25.30.30.30.
Carrier gas He HeHeHe
Substrate
Column diameter (mm) 0.250.250.250.250.25
Phase thickness (μm) 0.250.250.250.250.25
Tstart (C) 60.40.60.60.40.
Tend (C) 240.180.240.280.240.
Heat rate (K/min) 3.3.3.3.3.
Initial hold (min)     2.
Final hold (min)
I 1033.1030.1033.1030.1021.
ReferenceMacchioni, Cioni, et al., 2003Shao, Marriott, et al., 2003Tampieri, Galuppi, et al., 2003Tsiri, Kretsi, et al., 2003Verzera, Trozzi, et al., 2003
Comment MSDC-RI MSDC-RI MSDC-RI MSDC-RI MSDC-RI
Column type CapillaryCapillaryCapillaryCapillaryCapillary
Active phase CP Sil 8 CBSE-52DB-5DB-5DB-5
Column length (m) 60.25.30.30.30.
Carrier gas HeN2 HeHe
Substrate
Column diameter (mm) 0.250.320.250.250.25
Phase thickness (μm) 0.250.150.250.250.25
Tstart (C) 40.45.50.60.60.
Tend (C) 250.200.280.240.240.
Heat rate (K/min) 4.3.3.3.3.
Initial hold (min) 8.5.5.
Final hold (min) 10.20.
I 1043.1039.1031.1033.1033.
ReferenceDuckham, Dodson, et al., 2002Duru, Cakir, et al., 2002Economakis, Skaltsa, et al., 2002Flamini, Cioni, et al., 2002Flamini, Cioni, et al., 2002, 2
Comment MSDC-RI MSDC-RI MSDC-RI MSDC-RI MSDC-RI
Column type CapillaryCapillaryCapillaryCapillaryCapillary
Active phase DB-1SE-30HP-5BP-1CP Sil 5 CB
Column length (m) 25.25.30.50.25.
Carrier gas N2N2HeHeN2
Substrate
Column diameter (mm) 0.250.250.250.220.25
Phase thickness (μm)  0.250.250.250.25
Tstart (C) 60.60.60.60.60.
Tend (C) 180.180.280.220.280.
Heat rate (K/min) 3.3.3.2.4.
Initial hold (min) 10.10.  6.
Final hold (min) 10.10. 20.
I 1023.1023.1025.1021.1056.
Referencebin Jantan and bin Ahmad, 2002bin Jantan, Ayop, et al., 2002Kovacevic, Pavlovic, et al., 2002Lota, de Rocca Serra, et al., 2002Pino, Marbot, et al., 2002
Comment MSDC-RI MSDC-RI MSDC-RI MSDC-RI MSDC-RI
Column type CapillaryCapillaryCapillaryCapillaryCapillary
Active phase CP Sil 5 CBDB-1HP-5MSHP-5HP-5
Column length (m) 50.50.30.30.30.
Carrier gas HeHeHeHeHe
Substrate
Column diameter (mm) 0.320.220.250.250.25
Phase thickness (μm) 0.40.250.250.250.25
Tstart (C) 60.60.50.60.60.
Tend (C) 280.220.250.280.280.
Heat rate (K/min) 3.2.5.3.3.
Initial hold (min) 10. 2.5.5.
Final hold (min) 60.20.5.
I 1016.1021.1035.1005.1030.
ReferencePino, Marbot, et al., 2002, 2Pintore, Usai, et al., 2002Shang, Hu, et al., 2002Aligiannis, Kalpoutzakis, et al., 2001Aligiannis, Kalpoutzakis, et al., 2001
Comment MSDC-RI MSDC-RI MSDC-RI MSDC-RI MSDC-RI
Column type CapillaryCapillaryCapillaryCapillaryCapillary
Active phase HP-5BP-1BP-1CP Sil 5 CBCP Sil 5 CB
Column length (m) 30.50.50.50.50.
Carrier gas HeHeHeHeHe
Substrate
Column diameter (mm) 0.250.220.220.320.32
Phase thickness (μm) 0.250.250.250.40.4
Tstart (C) 60.60.60.60.60.
Tend (C) 280.220.220.280.280.
Heat rate (K/min) 3.2.2.3.3.
Initial hold (min) 5.  10.10.
Final hold (min)    60.60.
I 1029.1021.1021.1016.1016.
ReferenceAligiannis, Kalpoutzakis, et al., 2001, 2Lota, Serra, et al., 2001Lota, Serra, et al., 2001Pino and Marbot, 2001Pino, Marbot, et al., 2001
Comment MSDC-RI MSDC-RI MSDC-RI MSDC-RI MSDC-RI
Column type CapillaryCapillaryCapillaryCapillaryCapillary
Active phase BP-1BP-1HP-5MSBPX-5DB-5
Column length (m) 50.50.30.50.60.
Carrier gas He HeH2He
Substrate
Column diameter (mm) 0.220.220.250.220.25
Phase thickness (μm) 0.250.250.250.250.25
Tstart (C) 60.60.60.60.40.
Tend (C) 220.220.280.180.290.
Heat rate (K/min) 2.2.4.4.4.
Initial hold (min)   5.5.2.
Final hold (min) 20.20. 5.5.
I 1022.1021.1028.1042.1024.
ReferenceRezzi, Bighelli, et al., 2001Rezzi, Cavaleiro, et al., 2001Skaltsa, Mavrommati, et al., 2001Zabaras and Wyllie, 2001Bartley and Jacobs, 2000
Comment MSDC-RI MSDC-RI MSDC-RI MSDC-RI MSDC-RI
Column type CapillaryCapillaryCapillaryCapillaryCapillary
Active phase BP-1BP-1SE-30CP Sil 5 CBHP-5
Column length (m) 50.50.50.50.30.
Carrier gas HeHe H2He
Substrate
Column diameter (mm) 0.220.220.20.220.25
Phase thickness (μm) 0.250.25 0.130.25
Tstart (C) 60.60.50.40.70.
Tend (C) 230.230.250.300.230.
Heat rate (K/min) 2.2.6.4.2.
Initial hold (min)
Final hold (min) 35.35. 10.
I 1021.1021.1028.1026.1012.
ReferenceLota, de Rocca Serra, et al., 2000Lota, de Rocca Serra, et al., 2000Paramonov, Khalilova, et al., 2000Pfeifhofer, 2000Song, Sawamura, et al., 2000
Comment MSDC-RI MSDC-RI MSDC-RI MSDC-RI MSDC-RI
Column type CapillaryCapillaryCapillaryCapillaryCapillary
Active phase Mega 5MSOV-101DB-5BP-1BP-1
Column length (m) 30.25.30.50.50.
Carrier gas HeN2 HeHe
Substrate
Column diameter (mm) 0.250.250.250.220.22
Phase thickness (μm) 0.25 0.250.250.25
Tstart (C) 40.50.50.60.60.
Tend (C) 240.200.250.220.230.
Heat rate (K/min) 3.5.3.2.2.
Initial hold (min) 2.
Final hold (min)    20.35.
I 1021.1020.1031.1026.1022.
ReferenceVerzera, la Rosa, et al., 2000Menut, Bessiere, et al., 1999Isidorov, Zenkevich, et al., 1998Tam, An, et al., 1998Mariotti, Costa, et al., 1997
Comment MSDC-RI MSDC-RI MSDC-RI MSDC-RI MSDC-RI
Column type CapillaryCapillaryCapillaryCapillaryCapillary
Active phase BP-1Methyl SiliconeDB-1CP Sil 5 CBHP-101
Column length (m) 50.25.60.25.50.
Carrier gas HeHe HeN2
Substrate
Column diameter (mm) 0.220.20.320.220.25
Phase thickness (μm) 0.250.30.50.11
Tstart (C) 60.40.40.80.70.
Tend (C) 230.200.290.230.200.
Heat rate (K/min) 2.2.4.1.3.
Initial hold (min)   2.8.
Final hold (min) 35. 5.16.
I 1018.1029.1026.1013.1035.
ReferenceMariotti, Tomi, et al., 1997Píry, Príbela, et al., 1995Bartley and Foley, 1994Chanegriha and Baaliouamer, 1993Chung, Eiserich, et al., 1993
Comment MSDC-RI MSDC-RI MSDC-RI MSDC-RI MSDC-RI
Column type CapillaryCapillary
Active phase DB-1DB-5
Column length (m) 60.60.
Carrier gas  He
Substrate
Column diameter (mm) 0.320.32
Phase thickness (μm)  1.
Tstart (C) 50.40.
Tend (C) 250.220.
Heat rate (K/min) 4.3.
Initial hold (min) 0.1
Final hold (min)
I 1019.1034.
ReferenceFlath, Light, et al., 1990Le Quere and Latrasse, 1990
Comment MSDC-RI MSDC-RI

Normal alkane RI, polar column, temperature ramp

Data compiled by: NIST Mass Spectrometry Data Center, William E. Wallace, director

Column type CapillaryCapillaryCapillaryCapillaryCapillary
Active phase HP-InnowaxSupelcowax-10SupelcowaxRTX-WaxDB-Wax
Column length (m) 60.30.60.60.30.
Carrier gas HeliumHeliumNitrogenHeliumHelium
Substrate
Column diameter (mm) 0.250.200.350.220.25
Phase thickness (μm) 0.250.200.250.250.25
Tstart (C) 60.70.60.60.60.
Tend (C) 220.220.230.230.200.
Heat rate (K/min) 5.3.4.2.8.
Initial hold (min) 1.   3.
Final hold (min) 5.15.40.30.9.5
I 1218.1213.1215.1186.1240.
ReferenceFeng, Cui, et al., 2011Neves, Rosa, et al., 2010Gauvin-Bialecki and Marodon, 2009Museli, Pau, et al., 2009Rochat, Egger, et al., 2009
Comment MSDC-RI MSDC-RI MSDC-RI MSDC-RI MSDC-RI
Column type CapillaryCapillaryCapillaryCapillaryCapillary
Active phase HP-InnowaxHP-InnowaxCP-Wax 52CBHP-InnowaxCP-Wax 52CB
Column length (m) 30.30.60.30.30.
Carrier gas HeliumN2HeHeHe
Substrate
Column diameter (mm) 0.250.250.250.250.32
Phase thickness (μm) 0.250.250.250.250.25
Tstart (C) 50.50.40.60.40.
Tend (C) 240.240.220.240.220.
Heat rate (K/min) 15.5.3.2.3.
Initial hold (min) 10.1.  1.
Final hold (min) 19.4. 20.2.
I 1217.1210.1220.1210.1208.
ReferenceCharoensiddhi and Anprung, 2008Cheraif, Ben Jannet, et al., 2007Chyau, Tsai, et al., 2007Hachicha, Skanji, et al., 2007Hymete, Rohloff, et al., 2007
Comment MSDC-RI MSDC-RI MSDC-RI MSDC-RI MSDC-RI
Column type CapillaryCapillaryCapillaryCapillaryCapillary
Active phase TC-FFAPTC-FFAPSupelcowax-10CarbowaxSupelcowax-10
Column length (m)   30.60.30.
Carrier gas HeHeHeHe
Substrate
Column diameter (mm) 0.250.250.250.250.25
Phase thickness (μm) 0.250.250.250.250.25
Tstart (C) 60.60.50.40.40.
Tend (C) 220.220.250.180.210.
Heat rate (K/min) 3.3.2.5.2.
Initial hold (min)
Final hold (min) 30.30.  33.
I 1219.1220.1211.1217.1206.
ReferenceKurose, Okamura, et al., 2007Kurose, Okamura, et al., 2007Raal, Orav, et al., 2007Singh, Kumar, et al., 2007Sylvestre, Longtin, et al., 2007
Comment MSDC-RI MSDC-RI MSDC-RI MSDC-RI MSDC-RI
Column type CapillaryCapillaryCapillaryCapillaryCapillary
Active phase Supelcowax-10Supelcowax-10DB-WaxDB-WaxAT-Wax
Column length (m) 30.30.60.30.60.
Carrier gas  HeHeHeliumHe
Substrate
Column diameter (mm) 0.250.250.250.250.25
Phase thickness (μm) 0.250.250.250.250.25
Tstart (C) 40.40.60.40.60.
Tend (C) 250.250.180.250.200.
Heat rate (K/min) 2.3.3.3.4.
Initial hold (min)  5.8.
Final hold (min) 33.10.80.20.20.
I 1209.1204.1183.1188.1214.
ReferenceSylvestre, Pichette, et al., 2007Vichi, Riu-Aumatell, et al., 2007Wei A. and Shibamoto T., 2007Berlinet, Brat, et al., 2006Borges, Rojas, et al., 2006
Comment MSDC-RI MSDC-RI MSDC-RI MSDC-RI MSDC-RI
Column type CapillaryCapillaryCapillaryCapillaryCapillary
Active phase Supelcowax 10DB-WaxBP-20BP-20Supelcowax-10
Column length (m) 30.60.50.50.30.
Carrier gas HeliumN2HeHe
Substrate
Column diameter (mm) 0.200.250.220.220.25
Phase thickness (μm) 0.200.250.250.250.25
Tstart (C) 70.70.60.60.40.
Tend (C) 220.230.220.220.210.
Heat rate (K/min) 3.2.2.2.2.
Initial hold (min)  2.  2.
Final hold (min) 15.20.20.20.33.
I 1215.1256.1208.1208.1209.
ReferenceCavaleiro, Pinto, et al., 2006Choi, 2006Fanciullino, Tomi, et al., 2006Fanciullino, Tomi, et al., 2006Garneau F.X., Collin G., et al., 2006
Comment MSDC-RI MSDC-RI MSDC-RI MSDC-RI MSDC-RI
Column type CapillaryCapillaryCapillaryCapillaryCapillary
Active phase CP-Wax 52CBDB-WaxDB-WaxSupelcowax-10Innowax
Column length (m) 30.60.60.30.50.
Carrier gas He  HeHe
Substrate
Column diameter (mm) 0.320.250.250.250.2
Phase thickness (μm) 0.250.250.250.250.5
Tstart (C) 60.70.70.50.60.
Tend (C) 220.230.230.220.250.
Heat rate (K/min) 3.32.2.4.2.
Initial hold (min) 7.2.2.1.
Final hold (min) 3.20.20.10.60.
I 1206.1222.1219.1203.1161.
ReferenceHymete, Rohloff, et al., 2006Lan Phi N.T., Nishiyama C., et al., 2006Sawamura, Onishi, et al., 2006Wong, Lim, et al., 2006Bendimerad and Bendiab, 2005
Comment MSDC-RI MSDC-RI MSDC-RI MSDC-RI MSDC-RI
Column type CapillaryCapillaryCapillaryCapillaryCapillary
Active phase SupelcowaxStabilwaxDB-WaxDB-WaxDB-Wax
Column length (m) 60.30.60.60.60.
Carrier gas HeH2N2N2He
Substrate
Column diameter (mm) 0.20.320.250.250.32
Phase thickness (μm) 0.20.50.250.250.25
Tstart (C) 60.40.70.70.35.
Tend (C) 230.280.230.230.220.
Heat rate (K/min) 4.6.2.2.3.
Initial hold (min) 30.5.2.2.
Final hold (min)  5.20.20.
I 1196.1212.1235.1235.1201.
ReferenceGauvin and Smadja, 2005Jirovetz, Buchbauer, et al., 2005Njoroge, Koaze, et al., 2005Njoroge, Koaze, et al., 2005, 2Palá-Paúl, Pérez-Alonso, et al., 2005
Comment MSDC-RI MSDC-RI MSDC-RI MSDC-RI MSDC-RI
Column type CapillaryCapillaryCapillaryCapillaryCapillary
Active phase CP-Wax 52CBSupelcowax-10Supelcowax-10DB-WaxBP-20
Column length (m) 30.30.30.30.50.
Carrier gas He  He
Substrate
Column diameter (mm) 0.320.250.250.250.22
Phase thickness (μm) 0.250.250.250.250.25
Tstart (C) 40.40.40.90.60.
Tend (C) 220.210.220.220.220.
Heat rate (K/min) 4.2.3.7.2.
Initial hold (min) 1.2.5.2.
Final hold (min)  33.10.5.20.
I 1207.1190.1204.1250.1206.
ReferenceRohloff and Bones, 2005Stevanovic, Garneau, et al., 2005Vichi, Riu-Aumatell, et al., 2005Agnihotri, Thappa, et al., 2004Blanc, Muselli, et al., 2004
Comment MSDC-RI MSDC-RI MSDC-RI MSDC-RI MSDC-RI
Column type CapillaryCapillaryCapillaryCapillaryCapillary
Active phase DB-WaxSupelcowax-10DB-WaxDB-WaxSupelcowax-10
Column length (m) 60.60.60.60.50.
Carrier gas N2HeHeHeHe
Substrate
Column diameter (mm) 0.250.20.250.250.2
Phase thickness (μm) 0.250.2  0.25
Tstart (C) 70.60.60.60.70.
Tend (C) 230.200.220.220.230.
Heat rate (K/min) 2.4.2.2.2.
Initial hold (min) 2. 4.4.
Final hold (min) 20.40.
I 1238.1194.1211.1211.1213.
ReferenceChoi, 2004Gauvin, Ravaomanarivo, et al., 2004Jiang and Kubota, 2004Jiang and Kubota, 2004Orav, Stulova, et al., 2004
Comment MSDC-RI MSDC-RI MSDC-RI MSDC-RI MSDC-RI
Column type CapillaryCapillaryCapillaryCapillaryCapillary
Active phase Supelcowax-10DB-WaxDB-WaxHP-20MDB-Wax
Column length (m) 50.60.60.50.60.
Carrier gas He NitrogenHeHelium
Substrate
Column diameter (mm) 0.20.250.250.20.25
Phase thickness (μm) 0.250.250.250.2
Tstart (C) 70.70.70.70.70.
Tend (C) 230.230.230.180.210.
Heat rate (K/min) 2.2.2.4.2.
Initial hold (min)  2.2.4.
Final hold (min)  20. 10.60.
I 1213.1235.1235.1198.1220.
ReferenceOrav, Stulova, et al., 2004Sawamura, Son, et al., 2004Sawamura, Sou, et al., 2004Juteau, Jerkovic, et al., 2003Mookdasanit, Tamura, et al., 2003
Comment MSDC-RI MSDC-RI MSDC-RI MSDC-RI MSDC-RI
Column type CapillaryCapillaryCapillaryCapillaryCapillary
Active phase Supelcowax-10Carbowax 20MDB-WaxDB-WaxHP-Innowax
Column length (m) 50.50.60.60.50.
Carrier gas HeN2N2N2He
Substrate
Column diameter (mm) 0.20.250.250.250.2
Phase thickness (μm) 0.250.250.250.250.2
Tstart (C) 70.90.70.70.70.
Tend (C) 230.220.230.230.190.
Heat rate (K/min) 2.3.2.2.5.
Initial hold (min)   2.2.
Final hold (min)   20.20.
I 1213.1219.1218.1216.1226.
ReferenceOrav, Kailas, et al., 2003Priestap, van Baren, et al., 2003Tu, Onishi, et al., 2003Tu, Onishi, et al., 2003, 2Velasco-Negueruela, Pérez-Alonso, et al., 2003
Comment MSDC-RI MSDC-RI MSDC-RI MSDC-RI MSDC-RI
Column type CapillaryCapillaryCapillaryCapillaryCapillary
Active phase Carbowax 20MDB-WaxSupelcowax-10Supelcowax-10HP-Wax
Column length (m) 25.60.60.60.50.
Carrier gas N2H2HeHeN2
Substrate
Column diameter (mm) 0.250.320.20.20.25
Phase thickness (μm) 0.250.250.50.50.25
Tstart (C) 50.40.70.70.75.
Tend (C) 250.245.220.220.220.
Heat rate (K/min) 4.1.52.2.3.
Initial hold (min)     4.
Final hold (min) 10.20.
I 1216.1199.1213.1213.1219.
ReferenceZrira, Elamrani, et al., 2003Gancel, Ollé, et al., 2002Orav, Kailas, et al., 2002Orav, Kailas, et al., 2002Priestap, van Baren, et al., 2002
Comment MSDC-RI MSDC-RI MSDC-RI MSDC-RI MSDC-RI
Column type CapillaryCapillaryCapillaryCapillaryCapillary
Active phase DB-WaxDB-WaxDB-WaxDB-WaxDB-Wax
Column length (m) 60.60.60.60.60.
Carrier gas N2N2HeHeHe
Substrate
Column diameter (mm) 0.250.250.250.250.25
Phase thickness (μm) 0.250.250.250.25
Tstart (C) 70.70.40.45.40.
Tend (C) 230.230.200.240.220.
Heat rate (K/min) 2.2.2.3.2.
Initial hold (min) 2. 2.
Final hold (min) 20.
I 1225.1232.1207.1209.1218.
ReferenceTu, Onishi, et al., 2002Tu, Thanh, et al., 2002Umano, Hagi, et al., 2002Christoph, 2001Jiang and Kubota, 2001
Comment MSDC-RI MSDC-RI MSDC-RI MSDC-RI MSDC-RI
Column type CapillaryCapillaryCapillaryCapillaryCapillary
Active phase BP-20TC-WaxInnowaxCP-Wax 52CBDB-Wax
Column length (m) 50.60.60.50.30.
Carrier gas HeHeHeHeHe
Substrate
Column diameter (mm) 0.220.250.250.300.2
Phase thickness (μm) 0.25 0.250.25
Tstart (C) 60.80.60.40.50.
Tend (C) 230.250.220.220.180.
Heat rate (K/min) 2.4.4.3.3.
Initial hold (min)   10.5.8.
Final hold (min) 35.47.10.
I 1208.1204.1218.1215.1192.
ReferenceLota, de Rocca Serra, et al., 2001Miyazawa, Kurose, et al., 2001Baser, Özek, et al., 2000Chagonda, Makanda, et al., 2000Franco and Shibamoto, 2000
Comment MSDC-RI MSDC-RI MSDC-RI MSDC-RI MSDC-RI
Column type CapillaryCapillaryCapillaryCapillaryCapillary
Active phase DB-WaxDB-WaxBP-20HP-20MDB-Wax
Column length (m) 30.30.25.50.60.
Carrier gas HeHeNitrogenHeNitrogen
Substrate
Column diameter (mm) 0.20.20.500.200.25
Phase thickness (μm)   0.250.20
Tstart (C) 50.50.60.70.40.
Tend (C) 180.180.200.180.200.
Heat rate (K/min) 3.3.5.4.2.
Initial hold (min) 8.8. 4.10.
Final hold (min)
I 1200.1200.1203.1212.1224.
ReferenceFranco and Shibamoto, 2000Franco and Shibamoto, 2000Mallavarapu, Rao, et al., 2000Mastelic, Milos, et al., 2000Tamura, Boonbumrung, et al., 2000
Comment MSDC-RI MSDC-RI MSDC-RI MSDC-RI MSDC-RI
Column type CapillaryCapillaryCapillaryCapillaryCapillary
Active phase DB-WaxSupelcowax-10InnowaxHP-InnowaxDB-Wax
Column length (m) 60.30.60.60.60.
Carrier gas He HeHeHe
Substrate
Column diameter (mm) 0.250.250.250.250.25
Phase thickness (μm) 0.250.250.250.250.25
Tstart (C) 40.60.60.60.60.
Tend (C) 200.220.220.220.240.
Heat rate (K/min) 2.4.  4.
Initial hold (min) 2. 10.10.
Final hold (min)
I 1206.1210.1218.1218.1212.
ReferenceUmano, Hagi, et al., 2000Choo, Wong, et al., 1999Kaya, Baser, et al., 1999Kaya, Baser, et al., 1999, 2Ngassoum, Yonkeu, et al., 1999
Comment MSDC-RI MSDC-RI MSDC-RI MSDC-RI MSDC-RI
Column type CapillaryCapillaryCapillaryCapillaryCapillary
Active phase NB-351DB-WaxHP-Innowax FSCDB-WaxHP-Innowax FSC
Column length (m) 25.30.60.60.60.
Carrier gas H2N2HeH2He
Substrate
Column diameter (mm) 0.30.250.250.320.25
Phase thickness (μm) 0.50.250.250.25
Tstart (C) 70.45.60.60.60.
Tend (C) 250.220.220.220.240.
Heat rate (K/min) 5.3.4.3.4.
Initial hold (min) 2. 10. 10.
Final hold (min)   10. 10.
I 1231.1214.1218.1212.1213.
ReferenceOnocha, Ekundayo, et al., 1999Mölleken, Sinnwell, et al., 1998Tümen, Baser, et al., 1998Werkhoff, Güntert, et al., 1998Baser, Kirimer, et al., 1997
Comment MSDC-RI MSDC-RI MSDC-RI MSDC-RI MSDC-RI
Column type CapillaryCapillaryCapillaryCapillaryCapillary
Active phase BP-20SP-1000DB-WaxDB-WaxPEG-20M
Column length (m) 25.85.30.30.50.
Carrier gas  HeHeHeHe
Substrate
Column diameter (mm) 0.330.500.250.250.25
Phase thickness (μm) 0.5 0.250.25
Tstart (C) 80.65.20.50.70.
Tend (C) 220.225.200.200.250.
Heat rate (K/min) 5.3.4.4.2.
Initial hold (min)   4.4.
Final hold (min)   10.10.
I 1228.1204.1214.1216.1213.
ReferenceBignell, Dunlop, et al., 1997Brophy, Goldsack, et al., 1996Morales, Albarracín, et al., 1996Morales, Albarracín, et al., 1996Orav, Kailas, et al., 1996
Comment MSDC-RI MSDC-RI MSDC-RI MSDC-RI MSDC-RI
Column type CapillaryCapillaryCapillaryCapillaryCapillary
Active phase DB-WaxDB-WaxSupelcowax-10PEG-20MCarbowax 20M
Column length (m) 60.60.60.60.45.
Carrier gas HeHeHeHeHydrogen
Substrate
Column diameter (mm) 0.320.250.250.320.32
Phase thickness (μm) 0.500.250.250.251.0
Tstart (C) 50.50.40.70.60.
Tend (C) 250.180.200.180.200.
Heat rate (K/min) 8.2.53.2.2.
Initial hold (min) 1.5.3.7.5.
Final hold (min) 6. 30.
I 1215.1208.1198.1218.1216.
ReferenceSagrero-Nieves and Bartley, 1996Stashenko, Puertas, et al., 1996Wong and Lai, 1996Orav, Kuningas, et al., 1995Kollmannsberger, Nitz, et al., 1992
Comment MSDC-RI MSDC-RI MSDC-RI MSDC-RI MSDC-RI
Column type CapillaryCapillaryCapillaryCapillaryCapillary
Active phase DB-WaxFFAPDB-WaxCarbowax 20MCarbowax 20M
Column length (m) 30.50.60.150.25.
Carrier gas   He
Substrate
Column diameter (mm) 0.32 0.3220.660.30
Phase thickness (μm)   0.25
Tstart (C) 70.50.50.60.40.
Tend (C) 200.180.230.170.220.
Heat rate (K/min) 4.10.4.1.2.
Initial hold (min) 2.1. 40.5.
Final hold (min)
I 1224.1216.1208.1200.1208.
ReferenceWyllie, Brophy, et al., 1990Brophy, Davies, et al., 1989Engel, Flath, et al., 1988Buttery, Ling, et al., 1987Nykanen, 1986
Comment MSDC-RI MSDC-RI MSDC-RI MSDC-RI MSDC-RI
Column type Capillary
Active phase BP-20
Column length (m) 25.
Carrier gas
Substrate
Column diameter (mm) 0.2
Phase thickness (μm)
Tstart (C) 70.
Tend (C) 180.
Heat rate (K/min) 3.
Initial hold (min) 5.
Final hold (min)
I 1216.
ReferenceMacLeod and Snyder, 1985
Comment MSDC-RI

Van Den Dool and Kratz RI, polar column, temperature ramp

Data compiled by: NIST Mass Spectrometry Data Center, William E. Wallace, director

Column type CapillaryCapillaryCapillaryCapillaryCapillary
Active phase BP-20RTX-WaxRTX-WaxBP-20RTX-Wax
Column length (m) 50.60.60.50.60.
Carrier gas HeHeHeHeHe
Substrate
Column diameter (mm) 0.220.220.220.220.22
Phase thickness (μm) 0.250.250.250.250.25
Tstart (C) 60.60.60.60.60.
Tend (C) 220.230.230.220.230.
Heat rate (K/min) 2.2.2.2.2.
Initial hold (min)
Final hold (min) 20.30.35.20.45.
I 1215.1195.1215.1207.1214.
ReferenceDuquesnoy, Castola, et al., 2007Muselli, Rossi, et al., 2007Paolini, Muselli, et al., 2007Boti, Bighelli, et al., 2006Cavalli, Tomi, et al., 2006
Comment MSDC-RI MSDC-RI MSDC-RI MSDC-RI MSDC-RI
Column type CapillaryCapillaryCapillaryCapillaryCapillary
Active phase HP-WaxBP-20DB-WaxDB-WaxBP-20
Column length (m) 30.50.60.30.50.
Carrier gas N2HeHeHeHe
Substrate
Column diameter (mm) 0.250.220.320.250.22
Phase thickness (μm) 0.250.250.250.250.25
Tstart (C) 60.60.35.40.60.
Tend (C) 220.220.220.250.220.
Heat rate (K/min) 5.2.3.3.2.
Initial hold (min) 10.
Final hold (min)  20. 20.20.
I 1205.1214.1200.1183.1211.
ReferenceFlamini, Tebano, et al., 2006Gonny, Cavaleiro, et al., 2006Pala-Paul, Copeland, et al., 2006Berlinet, Ducruet, et al., 2005Boti J.B., Koukoua G., et al., 2005
Comment MSDC-RI MSDC-RI MSDC-RI MSDC-RI MSDC-RI
Column type CapillaryCapillaryCapillaryCapillaryCapillary
Active phase RTX-WaxDB-WaxBP-20DB-WaxInnowax
Column length (m) 60.30.50.30.50.
Carrier gas  HeHeHeHe
Substrate
Column diameter (mm) 0.220.250.220.250.25
Phase thickness (μm) 0.250.250.250.250.25
Tstart (C) 60.40.60.40.50.
Tend (C) 220.250.220.250.220.
Heat rate (K/min) 2.3.2.3.2.
Initial hold (min)     3.
Final hold (min) 20.20.20.20.20.
I 1201.1194.1208.1195.1189.
ReferenceCozzani, Muselli, et al., 2005Fanciullino, Gancel, et al., 2005Ferrari, Tomi, et al., 2005Gancel, Ollitrault, et al., 2005Lee, Lee, et al., 2005
Comment MSDC-RI MSDC-RI MSDC-RI MSDC-RI MSDC-RI
Column type CapillaryCapillaryCapillaryCapillaryCapillary
Active phase RTX-WaxSupelcowax-10DB-WaxHP-WaxDB-Wax
Column length (m) 60.60.30.30.60.
Carrier gas HeHeN2N2He
Substrate
Column diameter (mm) 0.220.20.250.250.32
Phase thickness (μm) 0.250.20.250.250.25
Tstart (C) 60.60.60.60.32.
Tend (C) 230.200.220.220.220.
Heat rate (K/min) 2.2.5.5.3.
Initial hold (min)   10.10.
Final hold (min) 35.10.
I 1215.1195.1218.1218.1203.
ReferencePaolini, Costa, et al., 2005Smadja, Rondeau, et al., 2005Bertoli, Menichini, et al., 2004Bertoli, Pistelli, et al., 2004Brophy, Goldsack, et al., 2004
Comment MSDC-RI MSDC-RI MSDC-RI MSDC-RI MSDC-RI
Column type CapillaryCapillaryCapillaryCapillaryCapillary
Active phase Supelcowax-10RTX-WaxHP-WaxBP-20DB-Wax
Column length (m) 30.30.30.50.30.
Carrier gas HeHeHe He
Substrate
Column diameter (mm) 0.20.250.250.220.25
Phase thickness (μm) 0.20.250.250.250.25
Tstart (C) 70.45.60.60.40.
Tend (C) 220.240.240.220.200.
Heat rate (K/min) 3.3.3.2.4.
Initial hold (min)  6.  5.
Final hold (min) 15.10. 20.20.
I 1214.1194.1190.1212.1203.
ReferenceCavaleiro, Salgueiro, et al., 2004Dugo, Mondello, et al., 2004Flamini, Bader, et al., 2004Gonny, Bradesi, et al., 2004Yu, Kim, et al., 2004
Comment MSDC-RI MSDC-RI MSDC-RI MSDC-RI MSDC-RI
Column type CapillaryCapillaryCapillaryCapillaryCapillary
Active phase DB-WaxHP-WaxDB-WaxRTX-WaxDB-Wax
Column length (m) 30.30.30.60.60.
Carrier gas HeN2HeHeH2
Substrate
Column diameter (mm) 0.250.250.250.220.32
Phase thickness (μm) 0.250.250.250.250.25
Tstart (C) 40.60.40.60.40.
Tend (C) 200.220.250.230.245.
Heat rate (K/min) 4.5.3.2.1.5
Initial hold (min) 5.10.
Final hold (min) 20. 20.45.20.
I 1205.1197.1185.1204.1195.
ReferenceYu, Kim, et al., 2004Bader, Caponi, et al., 2003Brat, Rega, et al., 2003Cavalli, Tomi, et al., 2003Gancel, Ollitrault, et al., 2003
Comment MSDC-RI MSDC-RI MSDC-RI MSDC-RI MSDC-RI
Column type CapillaryCapillaryCapillaryCapillaryCapillary
Active phase DB-WaxCP-Wax 52CBMegawaxDB-WaxBP-20
Column length (m) 30.50.30.60.50.
Carrier gas  HeHeN2He
Substrate
Column diameter (mm) 0.320.250.250.250.22
Phase thickness (μm) 0.50.20.250.250.25
Tstart (C) 40.32.40.70.60.
Tend (C) 240.220.220.230.220.
Heat rate (K/min) 7.1.2.2.2.
Initial hold (min)  1.6.
Final hold (min) 5. 10.20.20.
I 1241.1191.1181.1233.1208.
ReferenceHögnadóttir and Rouseff, 2003Kjeldsen, Christensen, et al., 2003Verzera, Trozzi, et al., 2003Choi, Kim. M.-S.L., et al., 2002Lota, de Rocca Serra, et al., 2002
Comment MSDC-RI MSDC-RI MSDC-RI MSDC-RI MSDC-RI
Column type CapillaryCapillaryCapillaryCapillaryCapillary
Active phase AT-WaxBP-20CP-Wax 52CBBP-20AT-Wax
Column length (m) 60.50.50.50.60.
Carrier gas He  HeHe
Substrate
Column diameter (mm) 0.320.220.250.220.32
Phase thickness (μm) 0.250.250.20.250.25
Tstart (C) 65.60.32.60.65.
Tend (C) 250.220.220.220.250.
Heat rate (K/min) 2.2.1.2.2.
Initial hold (min) 10. 1. 10.
Final hold (min) 60.20.  60.
I 1196.1208.1191.1208.1195.
ReferencePino, Marbot, et al., 2002Pintore, Usai, et al., 2002Kjeldsen, Christensen, et al., 2001Lota, Serra, et al., 2001Pino and Marbot, 2001
Comment MSDC-RI MSDC-RI MSDC-RI MSDC-RI MSDC-RI
Column type CapillaryCapillaryCapillaryCapillaryCapillary
Active phase AT-WaxBP-20DB-WaxDB-WaxDB-Wax
Column length (m) 60.50.60.60.60.
Carrier gas HeHeHeHeHe
Substrate
Column diameter (mm) 0.320.220.50.500.53
Phase thickness (μm) 0.250.250.321.01.0
Tstart (C) 65.60.40.60.50.
Tend (C) 250.220.290.225.220.
Heat rate (K/min) 2.2.4.3.3.
Initial hold (min) 10. 2.
Final hold (min) 60.20.5.
I 1196.1207.1208.1204.1204.
ReferencePino, Marbot, et al., 2001Rezzi, Bighelli, et al., 2001Bartley and Jacobs, 2000Brophy, Goldsack, et al., 2000Brophy, Goldsack, et al., 2000, 2
Comment MSDC-RI MSDC-RI MSDC-RI MSDC-RI MSDC-RI
Column type CapillaryCapillaryCapillaryCapillaryCapillary
Active phase DB-WaxCP-Wax 52CBDB-WaxDB-WaxDB-Wax
Column length (m) 60.25.60.30.30.
Carrier gas He N2HeHe
Substrate
Column diameter (mm) 0.530.250.250.250.25
Phase thickness (μm) 1.00.150.250.250.25
Tstart (C) 50.40.70.40.40.
Tend (C) 220.220.230.200.200.
Heat rate (K/min) 3.3.2.2.2.
Initial hold (min)  5.2.5.5.
Final hold (min)   20.20.20.
I 1204.1215.1233.1203.1210.
ReferenceBrophy, Goldsack, et al., 2000, 3Chagonda, Makanda, et al., 2000Choi and Sawamura, 2000Kim, Thuy, et al., 2000Kim, Thuy, et al., 2000
Comment MSDC-RI MSDC-RI MSDC-RI MSDC-RI MSDC-RI
Column type CapillaryCapillaryCapillaryCapillaryCapillary
Active phase BP-20BP-20DB-WaxCP-Wax 52CBCP-Wax 52CB
Column length (m) 50.50.60.50.50.
Carrier gas HeHeHe
Substrate
Column diameter (mm) 0.220.220.530.320.32
Phase thickness (μm) 0.250.25
Tstart (C) 60.60.50.60.60.
Tend (C) 230.230.220.220.220.
Heat rate (K/min) 2.2.3.4.4.
Initial hold (min)    5.5.
Final hold (min) 35.35. 30.30.
I 1208.1208.1204.1205.1205.
ReferenceLota, de Rocca Serra, et al., 2000Lota, de Rocca Serra, et al., 2000Brophy, Goldsack, et al., 1999Chevance and Farmer, 1999Chevance and Farmer, 1999, 2
Comment MSDC-RI MSDC-RI MSDC-RI MSDC-RI MSDC-RI
Column type CapillaryCapillaryCapillaryCapillaryCapillary
Active phase CP-Wax 52CBHP-InnowaxDB-WaxSP-1000DB-Wax
Column length (m) 50.60.60.85.60.
Carrier gas  HeHeHeHe
Substrate
Column diameter (mm) 0.320.250.320.50.32
Phase thickness (μm)
Tstart (C) 40.32.35.60.65.
Tend (C) 220.220.220.225.225.
Heat rate (K/min) 4.2.3.3.3.
Initial hold (min) 5.1.
Final hold (min) 30.40.
I 1205.1206.1203.1204.1204.
ReferenceChevance and Farmer, 1999, 2Christensen, Jakobsen, et al., 1999Brophy, Forster, et al., 1998Brophy, Forster, et al., 1998, 2Brophy, Goldsack, et al., 1998
Comment MSDC-RI MSDC-RI MSDC-RI MSDC-RI MSDC-RI
Column type CapillaryCapillaryCapillaryCapillaryCapillary
Active phase DB-WaxDB-WaxDB-WaxDB-WaxSP-1000
Column length (m) 60.60.30.60.85.
Carrier gas He  HeHe
Substrate
Column diameter (mm) 0.320.250.320.320.5
Phase thickness (μm)  0.250.5
Tstart (C) 35.40.40.65.65.
Tend (C) 220.200.245.225.225.
Heat rate (K/min) 3.3.3.3.3.
Initial hold (min)  5.3.
Final hold (min)  60.20.
I 1204.1205.1191.1204.1204.
ReferenceBrophy, Goldsack, et al., 1998, 2Cha, Kim, et al., 1998Ollé, Baumes, et al., 1998Brophy, Goldsack, et al., 1997Brophy, Goldsack, et al., 1997, 2
Comment MSDC-RI MSDC-RI MSDC-RI MSDC-RI MSDC-RI
Column type CapillaryCapillaryCapillaryCapillaryCapillary
Active phase BP-20BP-20DB-WaxCP-Wax 52CBSupelcowax-10
Column length (m) 50.50.25.50.60.
Carrier gas HeHeHeH2He
Substrate
Column diameter (mm) 0.220.220.250.230.25
Phase thickness (μm) 0.250.250.250.120.25
Tstart (C) 60.60.50.50.60.
Tend (C) 230.230.240.200.230.
Heat rate (K/min) 2.2.4.1.55.
Initial hold (min)   3.10.5.
Final hold (min) 35.35. 10.20.
I 1209.1203.1205.1201.1220.
ReferenceMariotti, Costa, et al., 1997Mariotti, Tomi, et al., 1997Möllenbeck, König, et al., 1997Chyau, Mau, et al., 1996Granicher, Christen, et al., 1995
Comment MSDC-RI MSDC-RI MSDC-RI MSDC-RI MSDC-RI
Column type CapillaryCapillaryCapillaryCapillaryCapillary
Active phase Carbowax 20MCP-Wax 52CBHP-20MHP-FFAPCarbowax 20M
Column length (m) 50.50.50.50.50.
Carrier gas HeH2HeHeHe
Substrate
Column diameter (mm) 0.20.320.250.250.25
Phase thickness (μm) 0.2
Tstart (C) 30.50.60.60.60.
Tend (C) 170.200.190.210.180.
Heat rate (K/min) 4.1.53.3.2.
Initial hold (min) 2.10.  4.
Final hold (min) 20.40.
I 1217.1219.1209.1243.1172.
ReferencePíry, Príbela, et al., 1995Wu and Yang, 1994Chung, Eiserich, et al., 1993Chung, Eiserich, et al., 1993Kawakami, Sachs, et al., 1990
Comment MSDC-RI MSDC-RI MSDC-RI MSDC-RI MSDC-RI
Column type CapillaryCapillaryCapillaryCapillary
Active phase DB-WaxDB-WaxDB-WaxCarbowax 20M
Column length (m) 30.30.30.60.
Carrier gas HeHeHeHe
Substrate
Column diameter (mm) 0.320.250.250.32
Phase thickness (μm) 0.50.250.25
Tstart (C) 40.50.50.50.
Tend (C) 220.250.250.225.
Heat rate (K/min) 3.4.4.1.5
Initial hold (min)  3.3.
Final hold (min)    80.
I 1207.1192.1200.1194.
ReferenceLe Quere and Latrasse, 1990Fröhlich, Duque, et al., 1989Fröhlich, Duque, et al., 1989Chen and Ho, 1988
Comment MSDC-RI MSDC-RI MSDC-RI MSDC-RI

Kovats' RI, polar column, temperature ramp

Data compiled by: NIST Mass Spectrometry Data Center, William E. Wallace, director

Column type CapillaryCapillaryCapillaryCapillaryCapillary
Active phase StabilwaxHP-WaxDB-WaxSupelcowax-10Supelcowax-10
Column length (m) 30.50.30.30.30.
Carrier gas N2HeHe
Substrate
Column diameter (mm) 0.320.20.32
Phase thickness (μm) 1.0.40.25
Tstart (C) 50.60.40.40.40.
Tend (C) 220.230.220.210.210.
Heat rate (K/min) 2.4.3.2.2.
Initial hold (min) 3. 5.2.2.
Final hold (min) 15.30. 120.120.
I 1222.1227.1195.1196.1195.
ReferenceHazzit, Baaliouamer, et al., 2006Gauvin, Lecomte, et al., 2004Lopes, Strobl, et al., 2004Loayza, Abujder, et al., 1995Loayza, Abujder, et al., 1995
Comment MSDC-RI MSDC-RI MSDC-RI MSDC-RI MSDC-RI
Column type CapillaryCapillaryCapillaryCapillaryCapillary
Active phase Supelcowax-10DB-WaxSupelcowax-10DB-WaxDB-Wax
Column length (m) 30.60.60.60.60.
Carrier gas  HeHe
Substrate
Column diameter (mm)  0.250.250.250.25
Phase thickness (μm)
Tstart (C) 40.40.35.40.40.
Tend (C) 210.200.200.220.220.
Heat rate (K/min) 2.2.3.2.2.
Initial hold (min) 2.2.5.10.10.
Final hold (min) 120. 20.
I 1202.1212.1208.1200.1201.
ReferenceLoayza, Abujder, et al., 1995Umano, Hagi, et al., 1994Wong and Tie, 1993Umano and Shibamoto, 1988Umano and Shibamoto, 1988
Comment MSDC-RI MSDC-RI MSDC-RI MSDC-RI MSDC-RI
Column type CapillaryCapillaryCapillary
Active phase BP-20Carbowax 20MCarbowax 20M
Column length (m) 25.100.100.
Carrier gas
Substrate
Column diameter (mm) 0.3320.280.28
Phase thickness (μm)
Tstart (C) 70.80.80.
Tend (C) 200.200.200.
Heat rate (K/min) 4.3.3.
Initial hold (min) 2.
Final hold (min)
I 1208.1197.1198.
ReferenceWyllie, Cook, et al., 1987Bernhard, Shibamoto, et al., 1983Bernhard, Shibamoto, et al., 1983
Comment MSDC-RI MSDC-RI MSDC-RI

Kovats' RI, polar column, custom temperature program

Data compiled by: NIST Mass Spectrometry Data Center, William E. Wallace, director

Column type Capillary
Active phase Carbowax
Column length (m) 127.
Carrier gas
Substrate
Column diameter (mm) 0.75
Phase thickness (μm)
Program not specified
I 1219.
ReferenceOkamoto, Ellison, et al., 1981
Comment MSDC-RI

Phase change data

Data compiled by: William E. Acree, Jr., James S. Chickos

Enthalpy of vaporization

ΔvapH (kcal/mol) Temperature (K) Method Reference Comment
11.4318.AStephenson and Malanowski, 1987Based on data from 303. - 363. K. See also Bukala, Majewski, et al., 1954.

References

Cunicao, Lopes, et al., 2007
Cunicao, M.M.; Lopes, A.R.; Côcco, L.C.; Yamamoto, C.I.; Plocharski, R.C.B.; Miguel, M.D.; Junior, A.G.; Auer, C.G.; Miguel, O.G., Phytochemical and antibacterial evaluation of essential oils from Ottonia Martiana Miq. (Piperaceae), J. Braz. Chem. Soc., 2007, 18, 1, 184-188, https://doi.org/10.1590/S0103-50532007000100021 . [all data]

Duquesnoy, Castola, et al., 2007
Duquesnoy, E.; Castola, V.; Casanova, J., Composition and chemical variability of the twig oil of Abies alba Miller from Corsica, Flavour Fragr. J., 2007, 22, 4, 293-299, https://doi.org/10.1002/ffj.1796 . [all data]

Maccioni, Baldini, et al., 2007
Maccioni, S.; Baldini, R.; Luigi Cioni, P.; Tebano, M.; Flamini, G., In vivo volatiles emission and essential oils from different organs and pollen of Cistus albidus from Caprione (Eastern Liguria, Italy), Flavour Fragr. J., 2007, 22, 1, 61-65, https://doi.org/10.1002/ffj.1759 . [all data]

Martins, Santos, et al., 2007
Martins, F.T.; Santos, M.H.; Polo, M.; Barbosa, L.C.A., Effects of the interactions among macronutrients, plant age and photoperiod in the composition of Hyptis suaveolens (L.) Poit essential oil from Alfenas (MG), Brazil, Flavour Fragr. J., 2007, 22, 2, 123-129, https://doi.org/10.1002/ffj.1769 . [all data]

Muselli, Rossi, et al., 2007
Muselli, A.; Rossi, P.-G.; Desjobert, J.-M.; Bernardini, A.-F.; Berti, L.; Costa, J., Chemical composition and antibacterial activity of Otanthus maritimus (L.) Hoffmanns. Link essential oils from Corsica, Flavour Fragr. J., 2007, 22, 3, 217-223, https://doi.org/10.1002/ffj.1787 . [all data]

Paolini, Muselli, et al., 2007
Paolini, J.; Muselli, A.; Bernardini, A.-F.; Bighelli, A.; Casanova, J.; Costa, J., Thymol derivatives from essential oil of Doronicum corsicum L., Flavour Fragr. J., 2007, 22, 6, 479-487, https://doi.org/10.1002/ffj.1824 . [all data]

Radulovic, Lazarevic, et al., 2007
Radulovic, N.; Lazarevic, J.; Ristic, N.; Palic, R., Chemotaxonomic significance of the volatiles in the genus Stachys (Lamiaceae): Essential oil composition of four Balkan Stachys species, Biochem. Syst. Ecol., 2007, 35, 4, 196-208, https://doi.org/10.1016/j.bse.2006.10.010 . [all data]

Rocha, Coelho, et al., 2007
Rocha, S.M.; Coelho, E.; Zrostlikova, J.; Delgadillo, I.; Coimbra b, M.A., Comprehensive two-dimensional gas chromatography with time-of-flight mass spectrometry of monoterpenoids as a powerful tool for grape origin traceability, J. Chromatogr. A, 2007, 1161, 1-2, 292-299, https://doi.org/10.1016/j.chroma.2007.05.093 . [all data]

Saroglou, Arfan, et al., 2007
Saroglou, V.; Arfan, M.; Shabir, A.; Hadjipavlou-Litina, D.; Skaltsa, H., Composition and antioxidant activity of the essential oil of Teucrium royleanum Wall. ex Benth growing in Pakistan, Flavour Fragr. J., 2007, 22, 2, 154-157, https://doi.org/10.1002/ffj.1774 . [all data]

Vagionas, Ngassapa, et al., 2007
Vagionas, K.; Ngassapa, O.; Runyoro, D.; Graikou, K.; Gortzi, O.; Chinou, I., Chemical analysis of edible aromatic plants growing in Tanzania, Food Chem., 2007, 105, 4, 1711-1717, https://doi.org/10.1016/j.foodchem.2007.05.029 . [all data]

Basta, Tzakou, et al., 2006
Basta, A.; Tzakou, O.; Couladis, M., The essential oil composition of Phlomis cretica C. Presl, Flavour Fragr. J., 2006, 21, 5, 795-797, https://doi.org/10.1002/ffj.1717 . [all data]

Boti, Bighelli, et al., 2006
Boti, J.B.; Bighelli, A.; Cavaleiro, C.; Salgueiro, L.; Casanova, J., Chemical variability of Juniperus oxycedrus ssp. oxycedrus berry and leaf oils from Corsica, analysed by combination of GC, GC-MS and 13C-NMR, Flavour Fragr. J., 2006, 21, 2, 268-273, https://doi.org/10.1002/ffj.1579 . [all data]

Bylaite and Meyer, 2006
Bylaite, E.; Meyer, A.S., · Characterisation of volatile aroma compounds of orange juices by three dynamic and static headspace gas chromatography techniques, Eur. Food Res. Technol., 2006, 222, 1-2, 176-184, https://doi.org/10.1007/s00217-005-0141-8 . [all data]

Cavalli, Tomi, et al., 2006
Cavalli, J.-F.; Tomi, F.; Bernardini, A.-F.; Casanova, J., Chemical variability of the essential oil of Helichrysum faradifani Sc. Ell. from Madagascar, Flavour Fragr. J., 2006, 21, 1, 111-114, https://doi.org/10.1002/ffj.1531 . [all data]

Flamini, Tebano, et al., 2006
Flamini, G.; Tebano, M.; Cioni, P.L.; Bagci, Y.; Dural, H.; Ertugrul, K.; Uysal, T.; Savran, A., A multivariate statistical approach to Centaurea classification using essential oil composition data of some species from Turkey, Pl. Syst. Evol., 2006, 261, 1-4, 217-228, https://doi.org/10.1007/s00606-006-0448-3 . [all data]

Gonny, Cavaleiro, et al., 2006
Gonny, M.; Cavaleiro, C.; Salgueiro, L.; Casanova, J., Analysis of Juniperus communis subsp. alpina needle, berry, wood and root oils by combination of GC, GC/MS and 13C-NMR, Flavour Fragr. J., 2006, 21, 1, 99-106, https://doi.org/10.1002/ffj.1527 . [all data]

Kukic J., Petrovic S., et al., 2006
Kukic J.; Petrovic S.; Pavlovic M.; Couladis M.; Tzakou O.; Niketic M., Composition of essential oil of Stachys alpina L. ssp dinarica Murb., Flavour Fragr. J., 2006, 21, 3, 539-542, https://doi.org/10.1002/ffj.1684 . [all data]

Liu J.M., Nan P., et al., 2006
Liu J.M.; Nan P.; Tsering Q.; Tsering T.; Bai Z.K.; Wang L.; Liu Z.J.; Zhong Y., Volatile constituents of the leaves and flowers of Salvia przewalskii Maxim. from Tibet, Flavour Fragr. J., 2006, 21, 3, 435-438, https://doi.org/10.1002/ffj.1607 . [all data]

Radulovic, Mananjarasoa, et al., 2006
Radulovic, N.; Mananjarasoa, E.; Harinantenaina, L.; Yoshinori, A., Essential oil composition of four Croton species from Madagascar and their chemotaxonomy, Biochem. Syst. Ecol., 2006, 34, 8, 648-653, https://doi.org/10.1016/j.bse.2006.02.005 . [all data]

Su, Ho, et al., 2006
Su, Y.C.; Ho, C.L.; Wang, E.I.C., Analysis of leaf essential oils from the indigenous five conifers of Taiwan, Flavour Fragr. J., 2006, 21, 3, 447-452, https://doi.org/10.1002/ffj.1685 . [all data]

Su, Ho, et al., 2006, 2
Su, Y.-C.; Ho, C.-L.; Wang, E.I.-C.; Chang, S.-T., Antifungal activities and chemical compositions of essential oils from leaves of four eucalypts, Taiwan J. For. Sci., 2006, 21, 1, 49-61. [all data]

Vundac, Pfeifhofer, et al., 2006
Vundac, V.B.; Pfeifhofer, H.W.; Brantner, A.H.; Males, Z.; Plazibat, M., Essential oils of seven Stachys taxa from Croatia, Biochem. Syst. Ecol., 2006, 34, 12, 875-881, https://doi.org/10.1016/j.bse.2006.04.010 . [all data]

Boti J.B., Koukoua G., et al., 2005
Boti J.B.; Koukoua G.; N'Guessan T.Y.; Muselli A.; Bernardini A.F.; Casanova J., Composition of the leaf, stem bark and root bark oils of Isolona cooperi investigated by GC (retention index), GC-MS and C-13-NMR spectroscopy, Phytochem. Anal., 2005, 16, 5, 357-363, https://doi.org/10.1002/pca.857 . [all data]

Brantner, Pfeifhofer, et al., 2005
Brantner, A.H.; Pfeifhofer, H.W.; Ercegovac, O.; Males, Z.; Plazibat, M., Essential oil composition and antioxidant activity of Thymus bracteosus Vis. ex Benth., Flavour Fragr. J., 2005, 20, 6, 596-600, https://doi.org/10.1002/ffj.1494 . [all data]

Cozzani, Muselli, et al., 2005
Cozzani, S.; Muselli, A.; Desjobert, J.-M.; Bernardini, A.-F.; Tomi, F.; Casanova, J., Chemical composition of essential oil of Teucrium polium subsp. capitatum (L.) from Corsica, Flavour Fragr. J., 2005, 20, 4, 436-441, https://doi.org/10.1002/ffj.1463 . [all data]

Fanciullino, Gancel, et al., 2005
Fanciullino, A.-L.; Gancel, A.-L.; Froelicher, Y.; Luro, F.; Ollitrault, P.; Brillouet, J.-M., Effects of Nucleo-cytoplasmic Interactions on Leaf Volatile Compounds from Citrus Somatic Diploid Hybrids, J. Agric. Food Chem., 2005, 53, 11, 4517-4523, https://doi.org/10.1021/jf0502855 . [all data]

Ferrari, Tomi, et al., 2005
Ferrari, B.; Tomi, F.; Casanova, J., Composition and chemical variability of Ferula communis essential oil from Corsica, Flavour Fragr. J., 2005, 20, 2, 180-185, https://doi.org/10.1002/ffj.1405 . [all data]

Flamini, Luigi Cioni, et al., 2005
Flamini, G.; Luigi Cioni, P.; Morelli, I., Composition of the essential oils and in vivo emission of volatiles of four Lamium species from Italy: L. purpureum, L. hybridum, L. bifidum and L. amplexicaule, Food Chem., 2005, 91, 1, 63-68, https://doi.org/10.1016/j.foodchem.2004.05.047 . [all data]

Gancel, Ollitrault, et al., 2005
Gancel, A.-L.; Ollitrault, P.; Froelicher, Y.; Tomi, F.; Jacquemond, C.; Luro, F.; Brillouet, J.-M., Leaf volatile compounds of six citrus somatic allotetraploid hybrids originating from various combinations of lime, lemon, citron, sweet orange, and grapefruit, J. Agric. Food Chem., 2005, 53, 6, 2224-2230, https://doi.org/10.1021/jf048315b . [all data]

Idzojtic, Kajba, et al., 2005
Idzojtic, M.; Kajba, D.; Franjic, J., Differentiation of F1 hybrids P. nigra J. F. Arnold × P. sylvestris L., P. nigra J. F. Arnold × P. densiflora Siebold et Zucc., P. nigra J. F. Arnold × P. thunbergiana Franco and their parental species by needle volatile composition, Biochem. Syst. Ecol., 2005, 33, 4, 427-439, https://doi.org/10.1016/j.bse.2004.10.008 . [all data]

bin Jantan, Yalvema, et al., 2005
bin Jantan, I.; Yalvema, M.F.; Ahmad, N.W.; Jamal, J.A., Insecticidal activities of the leaf oils of eight Cinnamomum species against Aedes aegypti and Aedes albopictus, Pharm. Biol., 2005, 43, 6, 526-532, https://doi.org/10.1080/13880200500220771 . [all data]

Paolini, Costa, et al., 2005
Paolini, J.; Costa, J.; Bernardini, A., Analysis of the essential oil from aerial parts of Eupatorium cannabinum subsp. corsicum (L.) by gas chromatography with electron impact and chemical ionization mass spectrometry, J. Chromatogr. A, 2005, 1076, 1-2, 170-178, https://doi.org/10.1016/j.chroma.2005.03.131 . [all data]

Smadja, Rondeau, et al., 2005
Smadja, J.; Rondeau, P.; Sing, A.S.C., Volatile constituents of five Citrus Petitgrain essential oils from Reunion, Flavour Fragr. J., 2005, 20, 4, 399-402, https://doi.org/10.1002/ffj.1438 . [all data]

Tchoumbougnang, Zollo, et al., 2005
Tchoumbougnang, F.; Zollo, P.H.A.; Boyom, F.F.; Nyegue, M.A.; Bessière, J.M.; Menut, C., Aromatic plants of tropical Central Africa. XLVIII. Comparative study of the essential oils of four Hyptis species from Cameroon: H. lanceolata Poit., H. pectinata (L.) Poit., H. spicigera Lam. and H. suaveolens Poit., Flavour Fragr. J., 2005, 20, 3, 340-343, https://doi.org/10.1002/ffj.1441 . [all data]

Antunes, Sevinate-Pinto, et al., 2004
Antunes, T.; Sevinate-Pinto, I.; Barroso, J.G.; Cavaleiro, C.; Salgueiro, L.R., Micromorphology of trichomes and composition of essential oil of Teucrium capitatum, Flavour Fragr. J., 2004, 19, 4, 336-340, https://doi.org/10.1002/ffj.1310 . [all data]

Bertoli, Menichini, et al., 2004
Bertoli, A.; Menichini, F.; Noccioli, C.; Morelli, I.; Pistelli, L., Volatile constituents of different organs of Psoralea bituminosa L., Flavour Fragr. J., 2004, 19, 2, 166-171, https://doi.org/10.1002/ffj.1315 . [all data]

Bertoli, Pistelli, et al., 2004
Bertoli, A.; Pistelli, L.; Morelli, I.; Fraternale, D.; Giamperi, L.; Ricci, D., Volatile constituents of different parts (roots, stems and leaves) of Smyrnium olusatrum L., Flavour Fragr. J., 2004, 19, 6, 522-525, https://doi.org/10.1002/ffj.1382 . [all data]

Cavaleiro, Salgueiro, et al., 2004
Cavaleiro, C.; Salgueiro, L.R.; Miguel, M.G.; da Cunha, A.P., Analysis by gas chromatography?mass spectrometry of the volatile components of Teucrium lusitanicum and Teucrium algarbiensis, J. Chromatogr. A, 2004, 1033, 1, 187-190, https://doi.org/10.1016/j.chroma.2004.01.005 . [all data]

Ceccarini, Macchia, et al., 2004
Ceccarini, L.; Macchia, M.; Flamini, G.; Cioni, P.L.; Caponi, C.; Morelli, I., Essential oil composition of Helianthus annuus L. leaves and heads of two cultivated hybride Carlos and Florom 350, Ind. Crops Prod., 2004, 19, 1, 13-17, https://doi.org/10.1016/S0926-6690(03)00076-1 . [all data]

Flamini, Bader, et al., 2004
Flamini, G.; Bader, A.; Cioni, P.L.; Katbeh-Bader, A.; Morelli, I., Composition of the essential oil of leaves, galls, and ripe and unripe fruits of Jordian Pistacia palaestina Boiss., J. Agric. Food Chem., 2004, 52, 3, 572-576, https://doi.org/10.1021/jf034773t . [all data]

Gonny, Bradesi, et al., 2004
Gonny, M.; Bradesi, P.; Casanova, J., Identification of the components of the essential oil from wild Corsican Daucus carota L. using 13C-NMR spectroscopy, Flavour Fragr. J., 2004, 19, 5, 424-433, https://doi.org/10.1002/ffj.1330 . [all data]

Javidnia, Miri, et al., 2004
Javidnia, K.; Miri, R.; Kamalinejad, M.; Sarkarzadeh, H.; Jamalian, A., Chemical composition of the essential oils of Anthemis altissima L. grown in Iran, Flavour Fragr. J., 2004, 19, 3, 213-216, https://doi.org/10.1002/ffj.1277 . [all data]

Karioti, Hadjipavlou-Litina, et al., 2004
Karioti, A.; Hadjipavlou-Litina, D.; Mensah, M.L.K.; Fleischer, T.C.; Skaltsa, H., Composition and antioxidant activity of the essential oils of Xylopia aethiopica (Dun) A. Rich. (Annonaceae) leaves, stem bark, root bark, and fresh and dried fruits, growing in Ghana, J. Agric. Food Chem., 2004, 52, 26, 8094-8098, https://doi.org/10.1021/jf040150j . [all data]

Mardarowicz, Wianowska, et al., 2004
Mardarowicz, M.; Wianowska, D.; Dawidowicz, A.L.; Sawicki, R., The influence of sample treatment on SPME extracts from conifers. I. Comparison of terpene composition in Engelmann Spruce (Picea engelmanii) using hydrodistillation, SPME and PLE, Annales Universitatis Mariae Curie-Sklodowska Lublin - Polonia, 2004, 59, 3, 25-42. [all data]

Mumm, Tiemann, et al., 2004
Mumm, R.; Tiemann, T.; Schulz, S.; Hilker, M., Analysis of volatiles from black pine (Pinus nigra): significance of wounding and egg deposition by a herbivorous sawfly, Phytochemistry, 2004, 65, 24, 3221-3230, https://doi.org/10.1016/j.phytochem.2004.10.010 . [all data]

Stashenko, Jaramillo, et al., 2004
Stashenko, E.E.; Jaramillo, B.E.; Martínez, J.R., Analysis of volatile secondary metabolites from Colombian Xylopia aromatica (Lamarck) by different extraction and headspace methods and gas chromatography, J. Chromatogr. A, 2004, 1025, 1, 105-113, https://doi.org/10.1016/j.chroma.2003.10.059 . [all data]

Yu, Kim, et al., 2004
Yu, E.J.; Kim, T.H.; Kim, K.H.; Lee, H.J., Aroma-active compounds of Pinus densiflora (red pine) needles, Flavour Fragr. J., 2004, 19, 6, 532-537, https://doi.org/10.1002/ffj.1337 . [all data]

Bader, Caponi, et al., 2003
Bader, A.; Caponi, C.; Cioni, P.L.; Flamini, G.; Morelli, I., Acorenone in the essential oil of flowering aerial parts of Seseli tortuosum L., Flavour Fragr. J., 2003, 18, 1, 57-58, https://doi.org/10.1002/ffj.1154 . [all data]

Brat, Rega, et al., 2003
Brat, P.; Rega, B.; Alter, P.; Reynes, M.; Brillouet, J.-M., Distribution of volatile compounds in the pulp, cloud, and serum of freshly squeezed orange juice, J. Agric. Food Chem., 2003, 51, 11, 3442-3447, https://doi.org/10.1021/jf026226y . [all data]

Cavaleiro, Salgueiro, et al., 2003
Cavaleiro, C.; Salgueiro, L.R.; da Cunha, A.P.; Figueiredo, A.C.; Barroso, J.G.; Bighelli, A.; Casanova, J., Composition and variability of the essential oils of the leaves and berries from Juniperus navicularis, Biochem. Syst. Ecol., 2003, 31, 2, 193-201, https://doi.org/10.1016/S0305-1978(02)00080-7 . [all data]

Cavalli, Tomi, et al., 2003
Cavalli, J.-F.; Tomi, F.; Bernardini, A.-F.; Casanova, J., Composition and chemical variability of the bark oil of Cedrelopsis grevei H. Baillon from Madagascar, Flavour Fragr. J., 2003, 18, 6, 532-538, https://doi.org/10.1002/ffj.1263 . [all data]

Ceva-Antunes, Bizzo, et al., 2003
Ceva-Antunes, P.M.N.; Bizzo, H.R.; Alves, S.M.; Antunes, O.A.C., Analysis of volatile compounds of taperebá (Spondias mombin L.) and Cajá (Spondias mombin L.) by simultaneous distillation and extraction (SDE) and solid phase microextraction (SPME), J. Agric. Food Chem., 2003, 51, 5, 1387-1392, https://doi.org/10.1021/jf025873m . [all data]

de Feo, Urrunaga Soria, et al., 2003
de Feo, V.; Urrunaga Soria, E.; Urrunaga Soria, R.; Senatore, F., Chemical composition of essential oils of senecio nutans Sch.-Bip. (Asteraceae), Flavour Fragr. J., 2003, 18, 3, 234-236, https://doi.org/10.1002/ffj.1204 . [all data]

Flamini, Luigi Cioni, et al., 2003
Flamini, G.; Luigi Cioni, P.; Morelli, I., Short communication. Use of solid-phase micro-extraction as a sampling technique in the determination of volatiles emitted by flowers, isolated flower parts and pollen, J. Chromatogr. A, 2003, 998, 1-2, 229-233, https://doi.org/10.1016/S0021-9673(03)00641-1 . [all data]

Gancel, Ollitrault, et al., 2003
Gancel, A.-L.; Ollitrault, P.; Froelicher, Y.; Tomi, F.; Jacquemond, C.; Luro, F.; Brillouet, J.-M., Leaf volatile compounds of seven citrus somatic tetraploid hybrids sharing willow leaf mandarin (Citrus deliciosa Ten.) as their common parent, J. Agric. Food Chem., 2003, 51, 20, 6006-6013, https://doi.org/10.1021/jf0345090 . [all data]

Högnadóttir and Rouseff, 2003
Högnadóttir, Á.; Rouseff, R.L., Identification of aroma active compounds in organce essence oil using gas chromatography-olfactometry and gas chromatography-mass spectrometry, J. Chromatogr. A, 2003, 998, 1-2, 201-211, https://doi.org/10.1016/S0021-9673(03)00524-7 . [all data]

Isidorov, Vinogorova, et al., 2003
Isidorov, V.A.; Vinogorova, V.T.; Rafalowski, K., HS-SPME analysis of volatile organic compounds of coniferous needle litter, Atmos. Environ., 2003, 37, 33, 4645-4650, https://doi.org/10.1016/j.atmosenv.2003.07.005 . [all data]

Jantan, Ling, et al., 2003
Jantan, I.; Ling, Y.E.; Romli, S.; Ayop, N.; Ahmad, A.S., A comparative study of the constituents of the essential oils of three Cinnamomum species from Malaysia, J. Essent. Oil Res., 2003, 15, 6, 387-391, https://doi.org/10.1080/10412905.2003.9698618 . [all data]

Macchioni, Cioni, et al., 2003
Macchioni, F.; Cioni, P.L.; Flamini, G.; Morelli, I.; Maccioni, S.; Ansaldi, M., Chemical composition of essential oils from needles, branches and cones of Pinus pinea, P. halepensis, P. pinaster and P. nigra from central Italy, Flavour Fragr. J., 2003, 18, 2, 139-143, https://doi.org/10.1002/ffj.1178 . [all data]

Shao, Marriott, et al., 2003
Shao, Y.; Marriott, P.; Shellie, R.; Hügel, H., Solid-phase micro-extraction-comprehensive two-dimensional gas chromatography of ginger (Zingiber officinale) volatiles, Flavour Fragr. J., 2003, 18, 1, 5-12, https://doi.org/10.1002/ffj.1133 . [all data]

Tampieri, Galuppi, et al., 2003
Tampieri, M.P.; Galuppi, R.; Carelle, M.S.; Macchioni, F.; Cioni, P.L.; Morelli, I., Effect of selected essential oils and pure compounds on Saprolegnia parasitica, Pharm. Biol., 2003, 41, 8, 584-591, https://doi.org/10.1080/13880200390501839 . [all data]

Tsiri, Kretsi, et al., 2003
Tsiri, D.; Kretsi, O.; Chinou, I.B.; Spyropoulos, C.G., Composition of fruit volatiles and annual changes in the volatiles of leaves of Eucalyptus camaldulensis Dehn. growing in Greece, Flavour Fragr. J., 2003, 18, 3, 244-247, https://doi.org/10.1002/ffj.1220 . [all data]

Verzera, Trozzi, et al., 2003
Verzera, A.; Trozzi, A.; Gazea, F.; Cicciarelloi, G.; Cotroneo, A., Effects of rootstock on the composition of bergamot (Citrus bergamia Risso et Poiteau) essential oil, J. Agric. Food Chem., 2003, 51, 1, 206-210, https://doi.org/10.1021/jf0206872 . [all data]

Duckham, Dodson, et al., 2002
Duckham, S.C.; Dodson, A.T.; Bakker, J.; Ames, J.M., Effect of cultivar and storage time on the volatile flavor components of baked potato, J. Agric. Food Chem., 2002, 50, 20, 5640-5648, https://doi.org/10.1021/jf011326+ . [all data]

Duru, Cakir, et al., 2002
Duru, M.E.; Cakir, A.; Harmandar, M., Composition of the volatile oils isolated from the leaves of Liquidambar orientalis Mill. var. orientalis and L. orientalis var. integriloba from Turkey, Flavour Fragr. J., 2002, 17, 2, 95-98, https://doi.org/10.1002/ffj.1050 . [all data]

Economakis, Skaltsa, et al., 2002
Economakis, C.; Skaltsa, H.; Demetzos, C.; Sokovic, M.; Thanos, C.A., Effect of phosphorus concentration of the nutrient solution on the volatile constituents of leaves and bracts of Origanum dictamnus, J. Agric. Food Chem., 2002, 50, 22, 6276-6280, https://doi.org/10.1021/jf0203444 . [all data]

Flamini, Cioni, et al., 2002
Flamini, G.; Cioni, P.L.; Morelli, I., Analysis of the essential oil of the aerial parts of Viola etrusca from Monte Labbro (South Tuscany, Italy) and in vivo analysis of flower volatiles using SPME, Flavour Fragr. J., 2002, 17, 2, 147-149, https://doi.org/10.1002/ffj.1060 . [all data]

Flamini, Cioni, et al., 2002, 2
Flamini, G.; Cioni, P.L.; Morelli, I.; Macchia, M.; Ceccarini, L., Main agronomic-productive characteristics of two ecotypes of Rosmarinus officinalis L. and chemical composition of their essential oils, J. Agric. Food Chem., 2002, 50, 12, 3512-3517, https://doi.org/10.1021/jf011138j . [all data]

bin Jantan and bin Ahmad, 2002
bin Jantan, I.; bin Ahmad, F., Chemical constituents of the essential oils of Goniothalamus malayanus Hook. f. and Thoms., Flavour Fragr. J., 2002, 17, 5, 372-374, https://doi.org/10.1002/ffj.1107 . [all data]

bin Jantan, Ayop, et al., 2002
bin Jantan, I.; Ayop, N.; Hiong, A.B.; Ahmad, A.S., Chemical composition of the essential oils of Cinnamomum cordatum Kosterm, Flavour Fragr. J., 2002, 17, 3, 212-214, https://doi.org/10.1002/ffj.1075 . [all data]

Kovacevic, Pavlovic, et al., 2002
Kovacevic, N.; Pavlovic, M.; Menkovic, N.; Tzakou, O.; Couladis, M., Composition of the essential oil from roots and rhizomes of Valeriana pancicii Halácsy Bald, Flavour Fragr. J., 2002, 17, 5, 355-357, https://doi.org/10.1002/ffj.1100 . [all data]

Lota, de Rocca Serra, et al., 2002
Lota, M.-L.; de Rocca Serra, D.; Tomi, F.; Jacquemond, C.; Casanova, J., Volatile components of peel and leaf oils of lemon and lime species, J. Agric. Food Chem., 2002, 50, 4, 796-805, https://doi.org/10.1021/jf010924l . [all data]

Pino, Marbot, et al., 2002
Pino, J.A.; Marbot, R.; Quert, R.; García, H., Study of essential oils of Eucalyptus resinifera Smith, E. tereticornis Smith and Corymbia maculata (Hook.) K.D. Hill L.A.S. Johnson, grown in Cuba, Flavour Fragr. J., 2002, 17, 1, 1-4, https://doi.org/10.1002/ffj.1026 . [all data]

Pino, Marbot, et al., 2002, 2
Pino, J.A.; Marbot, R.; Vázquez, C., Characterization of volatile in Cosa Rican Guava [Psidium friedrichsthalianum (Berg) Niedenzu] fruit, J. Agric. Food Chem., 2002, 50, 21, 6023-6026, https://doi.org/10.1021/jf011456i . [all data]

Pintore, Usai, et al., 2002
Pintore, G.; Usai, M.; Bradesi, P.; Juliano, C.; Boatto, G.; Tomi, F.; Chessa, M.; Cerri, R.; Casanova, J., Chemical composition and antimicrobial activity of Rosmarinus officinalis L. oils from Sardinia and Corsica, Flavour Fragr. J., 2002, 17, 1, 15-19, https://doi.org/10.1002/ffj.1022 . [all data]

Shang, Hu, et al., 2002
Shang, C.; Hu, Y.; Deng, C.; Hu, K., Rapid determination of volatile constituents of Michelia alba flowers by gas chromatography-mass spectrometry with solid-phase microextraction, J. Chromatogr. A, 2002, 942, 1-2, 283-288, https://doi.org/10.1016/S0021-9673(01)01382-6 . [all data]

Aligiannis, Kalpoutzakis, et al., 2001
Aligiannis, N.; Kalpoutzakis, E.; Mitaku, S.; Chinou, I.B., Composition and antimicrobial activity of the essential oils of two Origanum species, J. Agric. Food Chem., 2001, 49, 9, 4168-4170, https://doi.org/10.1021/jf001494m . [all data]

Aligiannis, Kalpoutzakis, et al., 2001, 2
Aligiannis, N.; Kalpoutzakis, E.; Chinou, I.B.; Mitaku, S.; Gikas, E.; Tsarbopoulos, A., Composition and antimicrobial activity of the essential oils of five taxa of Sideritis from Greece, J. Agric. Food Chem., 2001, 49, 2, 811-815, https://doi.org/10.1021/jf001018w . [all data]

Lota, Serra, et al., 2001
Lota, M.-L.; Serra, D.R.; Jacquemond, C.; Tomi, F.; Casanova, J., Chemical variability of peel and leaf essential oils of sour orange, Flavour Fragr. J., 2001, 16, 2, 89-96, https://doi.org/10.1002/1099-1026(200103/04)16:2<89::AID-FFJ950>3.0.CO;2-D . [all data]

Pino and Marbot, 2001
Pino, J.A.; Marbot, R., Volatile flavor constituents of acerola (Malpighia emarginata DC.) fruit, J. Agric. Food Chem., 2001, 49, 12, 5880-5882, https://doi.org/10.1021/jf010270g . [all data]

Pino, Marbot, et al., 2001
Pino, J.A.; Marbot, R.; Vázquez, C., Characterization of volatiles in strawberry guava (Psidium cattleianum Sabine) fruit, J. Agric. Food Chem., 2001, 49, 12, 5883-5887, https://doi.org/10.1021/jf010414r . [all data]

Rezzi, Bighelli, et al., 2001
Rezzi, S.; Bighelli, A.; Mouillot, D.; Casanova, J., Composition and chemical variability of the needle essential oil of Pinus nigra subsp. laricio from corsica, Flavour Fragr. J., 2001, 16, 5, 379-383, https://doi.org/10.1002/ffj.1018 . [all data]

Rezzi, Cavaleiro, et al., 2001
Rezzi, S.; Cavaleiro, C.; Bighelli, A.; Salgueiro, L.; da Cunha, A.P.; Casanova, J., Intraspecific chemical variability of the leaf essential oil of Juniperus phoenicea subsp. turbinata from Corsica, Biochem. Syst. Ecol., 2001, 29, 2, 179-188, https://doi.org/10.1016/S0305-1978(00)00044-2 . [all data]

Skaltsa, Mavrommati, et al., 2001
Skaltsa, H.D.; Mavrommati, A.; Constantinidis, T., A chemotaxonomic investigation of volatile constituents in Stachys subsect. Swainsonianeae (Labiatae), Phytochemistry, 2001, 57, 2, 235-244, https://doi.org/10.1016/S0031-9422(01)00003-6 . [all data]

Zabaras and Wyllie, 2001
Zabaras, D.; Wyllie, S.G., Quantitative analysis of terpenoids in the gas phase using headspace solid-phase microextraction (HS-SPME), Flavour Fragr. J., 2001, 16, 6, 411-416, https://doi.org/10.1002/ffj.1025 . [all data]

Bartley and Jacobs, 2000
Bartley, J.P.; Jacobs, A.L., Effects of drying on flavour compounds in Australian-grown ginger (Zingiber officinale), J. Sci. Food Agric., 2000, 80, 2, 209-215, https://doi.org/10.1002/(SICI)1097-0010(20000115)80:2<209::AID-JSFA516>3.0.CO;2-8 . [all data]

Lota, de Rocca Serra, et al., 2000
Lota, M.-L.; de Rocca Serra, D.; Tomi, F.; Casanova, J., Chemical variability of peel and leaf essential oils of mandarins from Citrus reticulata Blanco, Biochem. Syst. Ecol., 2000, 28, 1, 61-78, https://doi.org/10.1016/S0305-1978(99)00036-8 . [all data]

Paramonov, Khalilova, et al., 2000
Paramonov, E.A.; Khalilova, A.Z.; Odinokov, V.N.; Khalilov, L.M., Identification and biological activity of volatile organic compounds isolated from plants and insects. III. Chromatography-mass spectrometry of volatile compoundsof Aegopodium podagraria, Chem. Nat. Compd. (Engl. Transl.), 2000, 36, 6, 584-586, https://doi.org/10.1023/A:1017563708858 . [all data]

Pfeifhofer, 2000
Pfeifhofer, H.W., Composition of the essential oil of Pinus canariensis Sweet ex Sprengel, Flavour Fragr. J., 2000, 15, 4, 266-270, https://doi.org/10.1002/1099-1026(200007/08)15:4<266::AID-FFJ908>3.0.CO;2-E . [all data]

Song, Sawamura, et al., 2000
Song, H.S.; Sawamura, M.; Ito, T.; Kawashimo, K.; Ukeda, H., Quantitative determination of characteric flavour of Citrus junos (yuzu) peel oil, Flavour Fragr. J., 2000, 15, 4, 245-250, https://doi.org/10.1002/1099-1026(200007/08)15:4<245::AID-FFJ904>3.0.CO;2-V . [all data]

Verzera, la Rosa, et al., 2000
Verzera, A.; la Rosa, G.; Zappalà, M.; Cotroneo, A., Essential oil composition of different cultivars of bergamot grown in Sicily, Ital. J. Food Sci., 2000, 12, 4, 493-501. [all data]

Menut, Bessiere, et al., 1999
Menut, C.; Bessiere, J.M.; Samate, A.D.; Millogo-Rasolodimby, J.; Nacro, M., Apodophyllone and isotorquatone, two arenic ketones from Eucalyptus apodophylla, Phytochemistry, 1999, 51, 8, 975-978, https://doi.org/10.1016/S0031-9422(99)00050-3 . [all data]

Isidorov, Zenkevich, et al., 1998
Isidorov, V.A.; Zenkevich, I.G.; Dubis, E.N.; Slowikowski, A.; Wojciuk, E., Group identification of essential oils components using partition coefficients in a hexane-acetonitrile system, J. Chromatogr. A, 1998, 814, 1-2, 253-260, https://doi.org/10.1016/S0021-9673(98)00398-7 . [all data]

Tam, An, et al., 1998
Tam, N.T.; An, H.L.; Muselli, a.; Bighelli, A.; Casanova, J., Essential oil of an unidentified Illicium species from Ninh Binh Province, Vietnam, Flavour Fragr. J., 1998, 13, 6, 393-396, https://doi.org/10.1002/(SICI)1099-1026(199811/12)13:6<393::AID-FFJ764>3.0.CO;2-R . [all data]

Mariotti, Costa, et al., 1997
Mariotti, J.P.; Costa, J.; Bianchini, A.; Bernardini, A.F.; Casanova, J., Composition and variability of the essential oil of Stachys glutinosa L. from Corsica (France), Flavour Fragr. J., 1997, 12, 3, 205-209, https://doi.org/10.1002/(SICI)1099-1026(199705)12:3<205::AID-FFJ636>3.0.CO;2-I . [all data]

Mariotti, Tomi, et al., 1997
Mariotti, J.P.; Tomi, F.; Casanova, J.; Costa, J.; Bernardini, A.F., Composition of the essential oil of Cistus Iadaniferus L. cultivated in corsica (France), Flavour Fragr. J., 1997, 12, 3, 147-151, https://doi.org/10.1002/(SICI)1099-1026(199705)12:3<147::AID-FFJ631>3.0.CO;2-Q . [all data]

Píry, Príbela, et al., 1995
Píry, J.; Príbela, A.; Durcanská, J.; Farkas, P., Fractionation of volatiles from blackcurrant (Ribes nigrum L.) by different extractive methods, Food Chem., 1995, 54, 1, 73-77, https://doi.org/10.1016/0308-8146(95)92665-7 . [all data]

Bartley and Foley, 1994
Bartley, J.P.; Foley, P., Supercritical fluid extraction of Australian-grown ginger (Zingiber officinale), J. Sci. Food Agric., 1994, 66, 3, 365-371, https://doi.org/10.1002/jsfa.2740660314 . [all data]

Chanegriha and Baaliouamer, 1993
Chanegriha, N.; Baaliouamer, A., Evaluation of series-coupled gas chromatographic capillaries of different polarities. Application to the resolution of problem pairs of constituents in Algerian cypress essential oil, J. Chromatogr., 1993, 633, 1-2, 163-168, https://doi.org/10.1016/0021-9673(93)83150-Q . [all data]

Chung, Eiserich, et al., 1993
Chung, T.Y.; Eiserich, J.P.; Shibamoto, T., Volatile compounds isolated from edible Korean chamchwi (Aster scaber Thunb), J. Agric. Food Chem., 1993, 41, 10, 1693-1697, https://doi.org/10.1021/jf00034a033 . [all data]

Flath, Light, et al., 1990
Flath, R.A.; Light, D.M.; Jang, E.B.; Mon, T.R.; John, J.O., Headspace Examination of Volatile Emissions from Ripening Papaya (Carica papaya L., Solo Variety), J. Agric. Food Chem., 1990, 38, 4, 1060-1063, https://doi.org/10.1021/jf00094a032 . [all data]

Le Quere and Latrasse, 1990
Le Quere, J.-L.; Latrasse, A., Composition of the Essential Oils of Blackcurrant Buds (Ribes nigrum L.), J. Agric. Food Chem., 1990, 38, 1, 3-10, https://doi.org/10.1021/jf00091a001 . [all data]