Itaconic acid, 2TMS derivative

Van Den Dool and Kratz RI, non-polar column, temperature ramp

View large format table.

Column type Active phase I Reference Comment
CapillaryDB-51400.Kimura, Yamamoto, et al., 199930. m/0.25 mm/1. μm, He, 100. C @ 4. min, 4. K/min, 290. C @ 10. min
CapillarySE-521395.Lefevere, Verhaeghe, et al., 198925. m/0.32 mm/0.52 μm, He, 5. K/min; Tstart: 70. C; Tend: 270. C

Normal alkane RI, non-polar column, temperature ramp

View large format table.

Column type Active phase I Reference Comment
CapillaryHP-5MS1359.Lee, Yanamandra, et al., 200230. m/0.25 mm/0.25 μm, He, 70. C @ 3. min, 4. K/min, 280. C @ 3. min
CapillaryHP-5MS1419.Lee, Yanamandra, et al., 200230. m/0.25 mm/0.25 μm, He, 70. C @ 3. min, 4. K/min, 280. C @ 3. min

References

Kimura, Yamamoto, et al., 1999
Kimura, M.; Yamamoto, T.; Yamaguchi, S., Automated metabolic profiling and interpretation of GC/MS data for organic acidemia screening: a personal computer-based system, Tohoku J. Exp. Med., 1999, 188, 4, 317-334, https://doi.org/10.1620/tjem.188.317 . [all data]

Lefevere, Verhaeghe, et al., 1989
Lefevere, M.F.; Verhaeghe, B.J.; Declerck, D.H.; Van Bocxlaer, J.F.; De Leenheer, A.P.; De Sagher, R.M., Metabolic Profiling of Urinary Organic Acids by Single and Multicolumn Capillary Gas Chromatography, J. Chromatogr. Sci., 1989, 27, 1, 23-29, https://doi.org/10.1093/chromsci/27.1.23 . [all data]

Lee, Yanamandra, et al., 2002
Lee, B.Y.; Yanamandra, K.; Thurmon, T.F., Quantitative estimation of organic analytes with a capillary column, Am. Clin. Lab., 2002, May, 30-34. [all data]