Morphine, 2TMS derivative

Kovats' RI, non-polar column, isothermal

Data compiled by: NIST Mass Spectrometry Data Center, William E. Wallace, director

Column type CapillaryPacked
Active phase SPB-1OV-1
Column length (m) 25.2.
Carrier gas HeN2
Substrate  GasChrom Q
Column diameter (mm) 0.20
Phase thickness (μm)
Temperature (C) 250.260.
I 2513.2550.
ReferenceLora-Tamayo, Rams, et al., 1986Cashaw, Walsh, et al., 1971
Comment MSDC-RI MSDC-RI

References

Lora-Tamayo, Rams, et al., 1986
Lora-Tamayo, C.; Rams, M.A.; Chacon, J.M.R., Gas Chromatographic Data for 187 Nitrogen- or Phosphorus-Containing Drugs and Metabolites of Toxicological Interest Analysed on Methyl Silicone Capillary Columns, J. Chromatogr., 1986, 374, 73-85, https://doi.org/10.1016/S0378-4347(00)83254-5 . [all data]

Cashaw, Walsh, et al., 1971
Cashaw, J.L.; Walsh, M.J.; Yamanaka, Y.; Davis, V.E., Simultaneous determination of biogenic amines and narcotic alkaloids by gas-liquid chromatography, J. Chromatogr. Sci., 1971, 9, 2, 98-104, https://doi.org/10.1093/chromsci/9.2.98 . [all data]