lithium carbonate

Condensed phase thermochemistry data

Quantity Value Units Method Reference Comment
Δfliquid-1175.08kJ/molReviewChase, 1998Data last reviewed in March, 1966
Quantity Value Units Method Reference Comment
liquid,1 bar130.70J/mol*KReviewChase, 1998Data last reviewed in March, 1966
Quantity Value Units Method Reference Comment
Δfsolid-1216.04kJ/molReviewChase, 1998Data last reviewed in March, 1966
Quantity Value Units Method Reference Comment
solid90.31J/mol*KReviewChase, 1998Data last reviewed in March, 1966

Liquid Phase Heat Capacity (Shomate Equation)

Cp° = A + B*t + C*t2 + D*t3 + E/t2
H° − H°298.15= A*t + B*t2/2 + C*t3/3 + D*t4/4 − E/t + F − H
S° = A*ln(t) + B*t + C*t2/2 + D*t3/3 − E/(2*t2) + G
    Cp = heat capacity (J/mol*K)
    H° = standard enthalpy (kJ/mol)
    S° = standard entropy (J/mol*K)
    t = temperature (K) / 1000.

View plot Requires a JavaScript / HTML 5 canvas capable browser.

View table.

Temperature (K) 993. - 2000.
A 185.4350
B -0.000051
C 0.000030
D -0.000006
E -0.000003
F -1251.430
G 305.3410
H -1175.080
ReferenceChase, 1998
Comment Data last reviewed in March, 1966

Solid Phase Heat Capacity (Shomate Equation)

Cp° = A + B*t + C*t2 + D*t3 + E/t2
H° − H°298.15= A*t + B*t2/2 + C*t3/3 + D*t4/4 − E/t + F − H
S° = A*ln(t) + B*t + C*t2/2 + D*t3/3 − E/(2*t2) + G
    Cp = heat capacity (J/mol*K)
    H° = standard enthalpy (kJ/mol)
    S° = standard entropy (J/mol*K)
    t = temperature (K) / 1000.

View plot Requires a JavaScript / HTML 5 canvas capable browser.

View table.

Temperature (K) 298. - 683.683. - 993.
A 68.33230-6.394740
B 146.6390261.4660
C -162.5730-102.0050
D 248.026042.47230
E -0.702297-0.168328
F -1244.290-1211.740
G 130.362035.65690
H -1216.040-1216.040
ReferenceChase, 1998Chase, 1998
Comment Data last reviewed in March, 1966 Data last reviewed in March, 1966

References

Chase, 1998
Chase, M.W., Jr., NIST-JANAF Themochemical Tables, Fourth Edition, J. Phys. Chem. Ref. Data, Monograph 9, 1998, 1-1951. [all data]