9-Octadecenoic acid (Z)-, 2,3-bis(acetyloxy)propyl ester

Van Den Dool and Kratz RI, non-polar column, temperature ramp

View large format table.

Column type Active phase I Reference Comment
CapillaryHP-52897.Reis, de Faria, et al., 200030. m/0.25 mm/0.25 μm, He, 4. K/min, 290. C @ 15. min; Tstart: 50. C

References

Reis, de Faria, et al., 2000
Reis, M.G.; de Faria, A.D.; Bittrich, V.; Amaral, M.C.E.; Marsaioli, A.J., The chemistry of flower rewards - Oncidium (Orchidaceae), J. Braz. Chem. Soc., 2000, 11, 6, 600-608, retrieved from http://jbcs.sbq.org.br/jbcs/2000/vol11n6/07.pdf, https://doi.org/10.1590/S0103-50532000000600008 . [all data]