Fenthion

Kovats' RI, non-polar column, isothermal

View large format table.

Column type Active phase Temperature (C) I Reference Comment
CapillaryOV-1160.1920.Erdmann, Rochholz, et al., 1992
PackedSE-30210.1941.Oyama, Sano, et al., 1987N2, AW-DMCS; Column diameter: 0.53 mm

Kovats' RI, non-polar column, temperature ramp

View large format table.

Column type Active phase I Reference Comment
CapillaryDB-11957.Hall, Whitehead, et al., 1986He, 6. K/min; Column length: 15. m; Column diameter: 0.25 mm; Tstart: 100. C; Tend: 270. C
CapillaryDB-52000.Hall, Whitehead, et al., 1986He, 6. K/min; Column length: 15. m; Column diameter: 0.25 mm; Tstart: 100. C; Tend: 270. C

Kovats' RI, non-polar column, custom temperature program

View large format table.

Column type Active phase I Reference Comment
CapillaryHP-51981.Tanabe, Mitobe, et al., 200030. m/0.32 mm/0.25 μm; Program: 50C(1min) => 20C/min => 150C => 10C/min => 280C(4min)

Van Den Dool and Kratz RI, non-polar column, temperature ramp

View large format table.

Column type Active phase I Reference Comment
CapillarySLB-5MS1976.Mondello, Casilli, et al., 200730. m/0.25 mm/0.25 μm, He, 2. K/min; Tstart: 70. C; Tend: 300. C
CapillarySLB-5MS1983.Mondello, Casilli, et al., 200730. m/0.25 mm/0.25 μm, He, 2. K/min; Tstart: 70. C; Tend: 300. C
PackedOV-11919.Oyama, Sano, et al., 1987N2, AW-DMCS, 2. K/min; Column diameter: 0.53 mm; Tstart: 80. C; Tend: 220. C
CapillaryCBP-11918.Oyama, Sano, et al., 1987N2, 6. K/min; Column length: 12. m; Column diameter: 0.53 mm; Tstart: 120. C; Tend: 250. C

Normal alkane RI, non-polar column, isothermal

View large format table.

Column type Active phase Temperature (C) I Reference Comment
PackedOV-1190.1940.TSunoda, 1986Helium, Chromosorb W AW DMCS; Column length: 1. m

Normal alkane RI, non-polar column, temperature ramp

View large format table.

Column type Active phase I Reference Comment
CapillaryHP-52009.Murayama, Mukai, et al., 200030. m/0.32 mm/0.25 μm, 50. C @ 1. min, 10. K/min, 300. C @ 4. min
PackedOV-11930.TSunoda, 1986Helium, Chromosorb W AW DMCS, 4. K/min, 210. C @ 20. min; Column length: 1. m; Tstart: 140. C

Normal alkane RI, non-polar column, custom temperature program

View large format table.

Column type Active phase I Reference Comment
Capillary5 % Phenyl methyl siloxane1987.Department of Food Safety and Welfare, 200630. m/0.25 mm/0.25 μm, Helium; Program: 50 0C(1 min) 25 0C/min -> 125 0C 10 0C/min -> 300 0C (10 min)
Capillary5 % Phenyl methyl siloxane1990.Department of Food Safety and Welfare, 200630. m/0.25 mm/0.25 μm, Helium; Program: 50 0C(1 min) 25 0C/min -> 125 0C 10 0C/min -> 300 0C (10 min)
CapillaryHP-51981.Kawara, Asada, et al., 200530. m/0.25 mm/0.25 μm; Program: 50 0C (1 min) 20 0C/min -> 150 0C 10 0C/min -> 280 0C
CapillaryMethyl Silicone1937.Zenkevich, Ostroukhova, et al., 2002Program: not specified
CapillaryUltra-11917.Tameo and Kiyos, 1991Program: not specified

Normal alkane RI, polar column, custom temperature program

View large format table.

Column type Active phase I Reference Comment
CapillaryCarbowax 20M2944.Tameo and Kiyos, 1991Program: not specified

References

Erdmann, Rochholz, et al., 1992
Erdmann, F.; Rochholz, G.; Schütz, H., Retention-indices on OV-1 of approximately 170 commonly used pesticides, Mikrochim. Acta, 1992, 106, 3-6, 219-226, https://doi.org/10.1007/BF01242093 . [all data]

Oyama, Sano, et al., 1987
Oyama, N.; Sano, T.; Syoyama, M.; Maeda, K., Studies on systematic analysis of poisonous compounds in forensic chemistry. II. Application of capillary column gas chromatography to substance identification by means of retention indices, Eisei Kagaku, 1987, 33, 5, 342-348, https://doi.org/10.1248/jhs1956.33.342 . [all data]

Hall, Whitehead, et al., 1986
Hall, G.L.; Whitehead, W.E.; Mourer, C.R.; Shibamoto, T., A new gas chromatographic retention index for pesticides and related compounds, J. Hi. Res. Chromatogr. Chromatogr. Comm., 1986, 9, 5, 266-271, https://doi.org/10.1002/jhrc.1240090503 . [all data]

Tanabe, Mitobe, et al., 2000
Tanabe, A.; Mitobe, H.; Kawata, K.; Sakai, M.; Yasuhara, A., New monitoring system for ninety pesticides and related compounds in river water by solid-phase extraction with determination by gas chromatography/mass spectrometry, J. AOAC Int., 2000, 83, 1, 61-77. [all data]

Mondello, Casilli, et al., 2007
Mondello, L.; Casilli, A.; Tranchida, P.Q.; Presti, M.L.; Dugo, P.; Dugo, G., Comprehensive gas chromatography coupled to mass spectrometry for the separation of pesticides in a very complex matrix, Anal. Bioanal. Chem., 2007, 389, 6, 1755-1763, https://doi.org/10.1007/s00216-007-1412-y . [all data]

TSunoda, 1986
TSunoda, N., Simultaneous determination of organophosphorous pesticides in forencis chemistry by gas-liquid chromatography with hydrogen flame ionization detector, Eisei Kagaku, 1986, 32, 2, 91-100, https://doi.org/10.1248/jhs1956.32.91 . [all data]

Murayama, Mukai, et al., 2000
Murayama, H.; Mukai, H.; Mitobe, H.; Moriyama, N., Simple method for determining trace pesticides in air using extraction disks, Anal. Sci., 2000, 16, 3, 257-263, retrieved from http://wwwsoc.nii.ac.;p/jsac/analsci/pdfs/a160257.pdf, https://doi.org/10.2116/analsci.16.257 . [all data]

Department of Food Safety and Welfare, 2006
Department of Food Safety, Ministry of Health; Welfare, Analytical methods for residual compositional substances of agricultural chemicals, feed aadditives, and veterinary drugs in foods, 2006, retrieved from http://www.mhlw.go.jp/english/topics/foodsafety/positivelist060228/de/060526-1a.pdf. [all data]

Kawara, Asada, et al., 2005
Kawara, K.; Asada, T.; Oikawa, K.; Tanabe, A., Multiresidue determination of pesticides in sediments by ultrasonically assisted extraction and gas chromatography/mass spectrometry, J. AOAC International, 2005, 88, 5, 1440-1451. [all data]

Zenkevich, Ostroukhova, et al., 2002
Zenkevich, I.G.; Ostroukhova, O.K.; Dolzhenko, V.I., Optimum analytical parameters for chromatographic characterization of pesticides, J. Anal. Chem. USSR (Engl. Transl.), 2002, 57, 1, 35-39. [all data]

Tameo and Kiyos, 1991
Tameo, O.; Kiyos, I., Simultaneous determination of pesticides by capillary gas chromatography, Cannot be traslated (in Japan), 1991, 14, 2, 109-122. [all data]