2-Coumaranone

Normal alkane RI, non-polar column, temperature ramp

Data compiled by: NIST Mass Spectrometry Data Center, William E. Wallace, director

Column type Capillary
Active phase ZB-5
Column length (m) 30.
Carrier gas Helium
Substrate
Column diameter (mm) 0.25
Phase thickness (μm) 0.25
Tstart (C) 40.
Tend (C) 280.
Heat rate (K/min) 6.
Initial hold (min) 1.
Final hold (min) 9.
I 1250.
ReferenceHarrison and Priest, 2009
Comment MSDC-RI

Kovats' RI, non-polar column, isothermal

Data compiled by: NIST Mass Spectrometry Data Center, William E. Wallace, director

Column type Packed
Active phase Apiezon L
Column length (m) 1.8
Carrier gas N2
Substrate Chromosorb W
Column diameter (mm)
Phase thickness (μm)
Temperature (C) 170.
I 1289.
ReferenceArruda, Heinzen, et al., 1993
Comment MSDC-RI

References

Harrison and Priest, 2009
Harrison, B.M.; Priest, F.G., Composition of peaks used in the preparation of malt for Scotch Whisky production - influence of geographical source and extraction depth, J. Agric. Food Chem., 2009, 57, 6, 2385-2391, https://doi.org/10.1021/jf803556y . [all data]