Cyclohexane, 1,3-didecyl-

Normal alkane RI, non-polar column, custom temperature program

Data compiled by: NIST Mass Spectrometry Data Center, William E. Wallace, director

Column type Capillary
Active phase HP-5 MS
Column length (m) 30.
Carrier gas Helium
Substrate
Column diameter (mm) 0.25
Phase thickness (μm) 0.25
Program 40 0C (5 min) 30 0C/min -> 60 0C 6 0C/min -> 230 0C (10 min)
I 2634.
ReferenceGrzeszczuk, Wesolowska, et al., 2011
Comment MSDC-RI

References

Grzeszczuk, Wesolowska, et al., 2011
Grzeszczuk, M.; Wesolowska, A.; Jadczak, D.; Jakubowska, B., Nutritional value of Chili edible flowers, Acta Sci. Pol. Hortorum Cultus, 2011, 10, 2, 85-94. [all data]